{"text_format":"1","workbook":"xlsx","n_sheets":8,"sheets":["Raportowanie","Dane do wydruku BDW","liczydło","Obwoluta","Koperta","BDW(4)","mBank","KontaKasowe"],"not_rendered":{"charts":0,"images":21,"macros":1,"external_links":1,"defined_names":11,"comments":1,"pivot_tables":0},"unopened":[],"bounds":{"document_bytes":16777216,"sheet_cells":100000,"rows_first":2000,"rows_last":500,"rows_between":2000,"halvings":0,"cell_chars":16384,"cell_head_chars":4096},"cells_cut":0,"cells_raw":0,"read":"whole","date_system":"1900"}

{"sheet":"Raportowanie","index":0,"n_rows":16,"n_cols":3,"rows_kept":16,"cut":false,"hidden":false,"merged":[[3,0,15,0],[3,4,15,14],[0,1,2,1],[0,2,2,2],[0,3,15,3],[12,1,12,2],[0,4,2,13]]}
[null,null,"wysyłanie e-maila w tle"]
[]
[]
[null,"wyślij do"]
[null,"wyślij do wiadomości"]
[null,"data"]
[null,"miasto, nr kasy"]
[null,"godziny pracy"]
[null,"ilość biletów sprzedanych"]
[null,"wpływy za sprzedane bilety"]
[null,"ilość biletów zwróconych"]
[null,"kwota zwrotów"]
[null,"Zaznacz poniżej co będzie raportowane"]
[]
[]
[null,null,"grzegorz.pieprzak@intercity.pl"]

{"sheet":"Dane do wydruku BDW","index":1,"n_rows":17,"n_cols":44,"rows_kept":17,"cut":false,"hidden":false,"merged":[[0,1,0,2],[10,1,10,2],[1,1,1,2],[2,1,2,2],[7,6,7,12],[8,6,8,12],[9,6,9,12],[10,6,10,12],[9,3,9,5],[5,3,5,5],[10,3,10,5],[7,3,7,5],[7,1,7,2],[8,1,8,2],[5,6,5,12],[1,3,2,12],[3,3,3,12],[7,18,7,20],[8,3,8,5],[3,1,3,2],[17,3,17,4],[6,6,6,12],[4,3,4,12],[9,1,9,2],[6,3,6,5],[12,18,12,20],[8,18,8,20],[14,35,15,35],[1,34,12,34],[2,18,2,30],[8,21,8,30],[9,18,9,20],[0,28,1,30],[0,21,1,27],[0,18,1,20],[11,18,11,30],[3,18,3,30],[4,18,4,30],[5,18,5,30],[7,35,8,35],[7,21,7,29],[12,21,12,30],[13,0,15,0],[11,3,11,5],[13,1,13,32],[14,1,15,32],[11,6,11,12],[12,6,12,12],[12,1,12,2],[11,1,11,2],[2,0,12,0],[10,18,10,30],[9,21,9,30],[4,1,4,2],[12,3,12,5],[6,18,6,30],[5,1,5,2],[6,1,6,2]]}
[null,"grzegorz.pieprzak@intercity.pl",null,null,null,null,null,null,null,null,null,null,null,null,null,null,null,null,"SK",null,null,"Bankowy Dowód Wpłaty"]
[null,"DrukBDW&Raport_v8.24.02.29",null,""]
[null,null,null,null,null,null,null,null,null,null,null,null,null,null,null,null,null,null,"PKP Intercity S.A.  Aleje Jerozolimskie 142A, 02-305 Warszawa"]
[null,"wpłacający/a:",null,null,null,null,null,null,null,null,null,null,null,null,null,null,null,null,"Sekcja Handlowa w Krakowie"]
[null,"miejsce i nr kasy:",null,null,null,null,null,null,null,null,null,null,null,null,null,null,null,null,{"$f":"IF(D5<>\"\",D5&\", zmiana nr \"&D6,\"kasa i zmiana\")","v":"kasa i zmiana"}]
[null,"nr zmiany:",null,null,null,null,null,null,null,null,null,null,null,null,null,null,null,null,"nr konta: 82 1140 1010 4167 0000 0004 5016",null,null,null,null,null,null,null,null,null,null,null,null,null,null,null,null,"podaj wartość w PLN"]
[null,"wpłata:",null,null,null,null,null,null,null,null,null,null,null,null,null,null,null,null,{"$f":"\"wpłaca: \"&D4","v":"wpłaca: "},null,null,null,null,null,null,null,null,null,null,null,null,null,null,null,null,100]
[null,"liczba banknotów 500 zł",null,null,null,null,null,null,null,null,null,null,null,null,null,null,null,null,"utarg z dnia:",null,null,{"$f":"TODAY() + $AE$8","v":"2024-03-14"},null,null,null,null,null,null,null,null,null,null,null,null,null,{"$f":"IFERROR(AJ7/AJ12,\"\")","v":""}]
[null,"liczba banknotów 200 zł",null,null,null,null,null,null,null,null,null,null,null,null,null,null,null,null,{"$f":"\"kwota wpłaty: \"","v":"kwota wpłaty: "},null,null,{"$f":"IF(IF(B7=\"wpłata:\",D7,D8*500+D9*200+D10*100+D11*50+D12*20+D13*10)<>0,IF(B7=\"wpłata:\",D7,D8*500+D9*200+D10*100+D11*50+D12*20+D13*10),\"\")","v":""}]
[null,"liczba banknotów 100 zł",null,null,null,null,null,null,null,null,null,null,null,null,null,null,null,null,"słownie:",null,null,{"$f":"ZmienNaSlownie(V9)","v":""}]
[null,"liczba banknotów 50 zł",null,null,null,null,null,null,null,null,null,null,null,null,null,null,null,null,"wyświetli słownie kwoty od 1 do 999 999 PLN",null,null,null,null,null,null,null,null,null,null,null,null,null,null,null,null,"kurs wymiany Intercity za 1 EUR"]
[null,"liczba banknotów 20 zł"]
[null,"liczba banknotów 10 zł",null,null,null,null,null,null,null,null,null,null,null,null,null,null,null,null,"nr koperty",null,null,null,null,null,null,null,null,null,null,null,null,null,null,null,null,"podaj wartość w EUR"]
[null,"Wydrukuje oryginalny z mBanku BDW(2)",null,null,null,null,null,null,null,null,null,null,null,null,null,null,null,null,null,null,null,null,null,null,null,null,null,null,null,null,null,null,null,null,null,3.5]
[null,null,null,null,null,null,null,null,null,null,null,null,null,null,null,null,null,null,null,null,null,null,null,null,null,null,null,null,null,null,null,null,null,null,null,{"$f":"AJ14*AJ12","v":0}]
[]
[null,null,null,null,null,null,null,null,null,null,null,null,null,null,null,null,null,null,null,null,null,null,null,null,null,null,null,null,null,null,null,null,null,null,null,null,null,null,null,null,null,null,{"$f":"LEFT(D4, SEARCH(\" \",D4,1))","v":{"$error":"#VALUE!"}},{"$f":"RIGHT(D4,LEN(D4)-SEARCH(\" \",D4,1))","v":{"$error":"#VALUE!"}}]

{"sheet":"liczydło","index":2,"n_rows":27,"n_cols":26,"rows_kept":27,"cut":false,"hidden":true,"merged":[[28,2,29,3],[21,6,25,7],[0,2,0,3],[22,2,23,3],[24,2,25,3],[26,2,27,3],[26,6,27,7]]}
[null,null,"REZERWA KASOWA",null,null,null,"włącz do BFW2",{"$f":"20-COUNTIF(H2:H21,\"\")","v":0},"włącz do BFW1",null,{"$f":"SUM(K2:K64)","v":0},0,0,0,0,0,0,0,0,0,0,0,0,0,0,{"$f":"SUM(Z2:Z64)","v":0}]
["mat","ilosc","nominał","ilość",null,"dołóż"]
[500,{"$f":"IF($D$2=\"kwota\",Tabela3[[#This Row],[ilość]]/Tabela3[[#This Row],[mat]],Tabela3[[#This Row],[ilość]])","v":0},"500 zł",0,"<"]
[200,{"$f":"IF($D$2=\"kwota\",Tabela3[[#This Row],[ilość]]/Tabela3[[#This Row],[mat]],Tabela3[[#This Row],[ilość]])","v":0},"200 zł",0,"<"]
[100,{"$f":"IF($D$2=\"kwota\",Tabela3[[#This Row],[ilość]]/Tabela3[[#This Row],[mat]],Tabela3[[#This Row],[ilość]])","v":0},"100 zł",0,"<"]
[50,{"$f":"IF($D$2=\"kwota\",Tabela3[[#This Row],[ilość]]/Tabela3[[#This Row],[mat]],Tabela3[[#This Row],[ilość]])","v":0},"50 zł",0,"<"]
[20,{"$f":"IF($D$2=\"kwota\",Tabela3[[#This Row],[ilość]]/Tabela3[[#This Row],[mat]],Tabela3[[#This Row],[ilość]])","v":0},"20 zł",0,"<"]
[10,{"$f":"IF($D$2=\"kwota\",Tabela3[[#This Row],[ilość]]/Tabela3[[#This Row],[mat]],Tabela3[[#This Row],[ilość]])","v":0},"10 zł",0,"<"]
[5,{"$f":"IF($D$2=\"kwota\",Tabela3[[#This Row],[ilość]]/Tabela3[[#This Row],[mat]],Tabela3[[#This Row],[ilość]])","v":0},"5 zł",0,"<"]
[2,{"$f":"IF($D$2=\"kwota\",Tabela3[[#This Row],[ilość]]/Tabela3[[#This Row],[mat]],Tabela3[[#This Row],[ilość]])","v":0},"2 zł",0,"<"]
[1,{"$f":"IF($D$2=\"kwota\",Tabela3[[#This Row],[ilość]]/Tabela3[[#This Row],[mat]],Tabela3[[#This Row],[ilość]])","v":0},"1 zł",0,"<"]
[0.5,{"$f":"IF($D$2=\"kwota\",Tabela3[[#This Row],[ilość]]/Tabela3[[#This Row],[mat]],Tabela3[[#This Row],[ilość]])","v":0},"50 gr",0,"<"]
[0.2,{"$f":"IF($D$2=\"kwota\",Tabela3[[#This Row],[ilość]]/Tabela3[[#This Row],[mat]],Tabela3[[#This Row],[ilość]])","v":0},"20 gr",0,"<"]
[0.1,{"$f":"IF($D$2=\"kwota\",Tabela3[[#This Row],[ilość]]/Tabela3[[#This Row],[mat]],Tabela3[[#This Row],[ilość]])","v":0},"10 gr",0,"<"]
[0.05,{"$f":"IF($D$2=\"kwota\",Tabela3[[#This Row],[ilość]]/Tabela3[[#This Row],[mat]],Tabela3[[#This Row],[ilość]])","v":0},"5 gr",0,"<"]
[0.02,{"$f":"IF($D$2=\"kwota\",Tabela3[[#This Row],[ilość]]/Tabela3[[#This Row],[mat]],Tabela3[[#This Row],[ilość]])","v":0},"2 gr",0,"<"]
[0.01,{"$f":"IF($D$2=\"kwota\",Tabela3[[#This Row],[ilość]]/Tabela3[[#This Row],[mat]],Tabela3[[#This Row],[ilość]])","v":0},"1 gr",0,"<"]
[null,null,"pozostałość",{"$f":"IF($D$2=\"kwota\",SUM(D3:D17),SUMPRODUCT(Tabela3[mat],Tabela3[ilość]))","v":0},0]
[null,null,"pozost. rPOS"]
[null,null,"różnica",{"$f":"D18-D19","v":0}]
[null,null,"przelew",0,"<"]
[null,null,"pozost. + przelew",{"$f":"D21+D18","v":0},null,null,"Przycisk u góry 'usuń i ustaw' czyści wpisy biletów i ustawia selekcję pierwszej komórki, do której będą skanowane numery biletów."]
[null,null,"R E S E T"]
[]
[null,null,"Z A M K N I J"]
[]
[null,null,"icsite.7m.pl",null,null,null,"Z A M K N I J"]

{"sheet":"Obwoluta","index":3,"n_rows":28,"n_cols":9,"rows_kept":28,"cut":false,"hidden":true,"merged":[[1,7,54,7],[21,8,21,13],[23,8,23,13],[25,8,25,13],[27,8,27,13],[29,9,29,13],[30,9,30,13],[31,9,31,13],[32,9,32,13],[33,9,33,13],[34,9,34,13],[35,9,35,13],[36,9,36,13],[37,9,37,13],[38,9,38,13],[39,9,39,13],[40,9,40,13],[41,9,41,13],[42,9,42,13],[43,9,43,13],[44,9,44,13],[45,9,45,13],[46,9,46,13],[47,9,47,13],[53,9,53,13],[54,9,54,13],[55,9,55,13],[48,9,48,13],[49,9,49,13],[50,9,50,13],[51,9,51,13],[52,9,52,13],[16,8,19,13],[2,0,2,2],[3,0,3,2],[4,0,4,2],[5,0,5,2],[6,0,6,2],[7,0,7,2],[8,0,8,2],[9,0,9,2],[10,0,10,2],[11,0,11,2],[12,0,12,2],[13,0,13,2],[14,0,14,2],[15,0,15,2],[1,6,54,6],[16,0,16,2],[17,0,17,2],[18,0,18,2],[19,0,19,2],[20,0,20,2],[21,0,21,2],[22,0,22,2],[23,0,23,2],[24,0,24,2],[25,0,25,2],[26,0,26,2],[27,0,27,2],[28,0,28,2],[29,0,29,2],[30,0,30,2],[37,0,37,2],[38,0,38,2],[39,0,39,2],[40,0,40,2],[31,0,31,2],[32,0,32,2],[33,0,33,2],[34,0,34,2],[35,0,35,2],[51,0,51,2],[52,0,52,2],[53,0,53,2],[54,0,54,2],[1,0,1,5],[46,0,46,2],[47,0,47,2],[48,0,48,2],[49,0,49,2],[50,0,50,2],[41,0,41,2],[42,0,42,2],[43,0,43,2],[44,0,44,2],[45,0,45,2],[36,0,36,2]]}
[]
[null,null,null,null,null,null,{"$f":"H2","v":"Wydział Rozliczeń Międzynarodowych"},"Wydział Rozliczeń Międzynarodowych"]
[]
[]
[]
[]
[]
[]
[]
[]
[]
[]
[]
[]
[]
[]
[null,null,null,null,null,null,null,null,"BFW2"]
[]
[]
[]
[]
[null,null,null,null,null,null,null,null,{"$f":"\"\"&'Dane do wydruku BDW'!D5","v":""}]
[]
[null,null,null,null,null,null,null,null,{"$f":"\"zmiana: \" &'Dane do wydruku BDW'!D6","v":"zmiana: "}]
[]
[null,null,null,null,null,null,null,null,{"$f":"\"\"&'Dane do wydruku BDW'!D4","v":""}]
[]
[null,null,null,null,null,null,null,null,"2024-02-22"]

{"sheet":"Koperta","index":4,"n_rows":63,"n_cols":10,"rows_kept":63,"cut":false,"hidden":true,"merged":[[8,3,8,8],[62,0,105,0],[62,9,84,9],[106,1,106,8],[15,3,15,8],[14,3,14,8],[13,3,13,8],[12,3,12,8],[16,3,16,8],[17,3,17,8],[10,3,10,8],[11,3,11,8]]}
[]
[]
[]
[]
[]
[]
[]
[]
[null,null,null,"mBank S.A."]
[]
[null,null,null,"PKP Intercity S.A."]
[null,null,null,"Sekcja Handlowa w Katowicach"]
[null,null,null,"Stacja Katowice, kasa nr 26"]
[null,null,null,"84 1140 1010 4167 0000 0052 2026"]
[null,null,null,"Zmiana nr 42"]
[null,null,null,"2024-02-22"]
[null,null,null,"Kasjer: Pieprzak Grzegorz"]
[null,null,null,"Kwota: 1200 zł"]
[]
[]
[]
[]
[]
[]
[]
[]
[]
[]
[]
[]
[]
[]
[]
[]
[]
[]
[]
[]
[]
[]
[]
[]
[]
[]
[]
[]
[]
[]
[]
[]
[]
[]
[]
[]
[]
[]
[]
[]
[]
[]
[]
[]
["SKLEIĆ LUB ZSZYĆ",null,null,null,null,null,null,null,null,"SKLEIĆ LUB ZSZYĆ"]

{"sheet":"BDW(4)","index":5,"n_rows":98,"n_cols":18,"rows_kept":98,"cut":false,"hidden":true,"merged":[[24,10,24,12],[24,15,24,17],[23,6,23,8],[23,1,23,3],[22,1,22,3],[22,6,22,8],[0,2,0,3],[0,7,0,8],[1,2,1,3],[1,7,1,8],[2,1,2,3],[2,6,2,8],[3,1,4,3],[3,6,4,8],[6,1,7,3],[6,6,7,8],[9,1,10,1],[9,2,10,3],[9,6,10,6],[9,7,10,8],[12,1,13,2],[12,3,13,3],[12,6,13,7],[12,8,13,8],[15,1,16,3],[15,6,16,8],[17,2,17,3],[17,7,17,8],[18,2,21,3],[18,7,21,8],[35,1,36,1],[35,2,36,3],[38,1,39,2],[38,3,39,3],[41,1,42,3],[26,2,26,3],[27,2,27,3],[28,1,28,3],[32,1,33,3],[29,1,30,3],[74,1,74,3],[74,6,74,8],[44,2,47,3],[47,7,47,8],[43,2,43,3]]}
[null,"Bankowy dowód wpłaty","mBank S.A.",null,null,null,"Bankowy dowód wpłaty","mBank S.A."]
[null,"Nazwa i adres właściciela rachunku:",null,null,null,null,"Nazwa i adres właściciela rachunku:",null,null,null,"specyfikacja",null,null,null,null,"specyfikacja"]
[null,"PKP Intercity S.A.",null,null,null,null,{"$f":"B3","v":"PKP Intercity S.A."},null,null,null,"sztuk","nominał","wartość",null,null,"sztuk","nominał","wartość"]
[null,"Aleje Jerozolimskie 142A, 02-305 Warszawa",null,null,null,null,{"$f":"B4","v":"Aleje Jerozolimskie 142A, 02-305 Warszawa"},null,null,null,{"$f":"IF($B54=\"\",\"\",$B54)","v":""},"500 zł",{"$f":"IF(K4=\"\",\"\",K4*L4)","v":""},null,null,{"$f":"IF(K4=\"\",\"\",K4)","v":""},"500 zł",{"$f":"IF(P4=\"\",\"\",P4*Q4)","v":""}]
[null,null,null,null,null,null,null,null,null,null,{"$f":"IF($B55=\"\",\"\",$B55)","v":3},"200 zł",{"$f":"IF(K5=\"\",\"\",K5*L5)","v":600},null,null,{"$f":"IF(K5=\"\",\"\",K5)","v":3},"200 zł",{"$f":"IF(P5=\"\",\"\",P5*Q5)","v":600}]
[null,"Nazwa i adres wpłacającego:",null,null,null,null,"Nazwa i adres wpłacającego:",null,null,null,6,"100 zł",600,null,null,6,"100 zł",600]
[null,"Pieprzak Grzegorz",null,null,null,null,{"$f":"B7","v":"Pieprzak Grzegorz"},null,null,null,"","50 zł","",null,null,"","50 zł",""]
[null,null,null,null,null,null,null,null,null,null,"","20 zł","",null,null,"","20 zł",""]
[null,"Nr rachunku:","Data wpłaty:",null,null,null,"Nr rachunku:","Data wpłaty:",null,null,"","10 zł","",null,null,"","10 zł",""]
[null,"84 1140 1010 4167 0000 0052 2026","2024-03-14",null,null,null,{"$f":"B10","v":"84 1140 1010 4167 0000 0052 2026"},{"$f":"C10","v":"2024-03-14"},null,null,"","5 zł","",null,null,"","5 zł",""]
[null,null,null,null,null,null,null,null,null,null,"","2 zł","",null,null,"","2 zł",""]
[null,"Kwota wpłaty:",null,"Waluta:",null,null,"Kwota wpłaty:",null,"Waluta:",null,"","1 zł","",null,null,"","1 zł",""]
[null,1200,null,"PLN",null,null,{"$f":"B13","v":1200},null,"PLN",null,"","50 gr","",null,null,"","50 gr",""]
[null,null,null,null,null,null,null,null,null,null,"","20 gr","",null,null,"","20 gr",""]
[null,"Kwota słownie:",null,null,null,null,"Kwota słownie:",null,null,null,"","10 gr","",null,null,"","10 gr",""]
[null,"jeden tysiąc dwieście PLN 0/100",null,null,null,null,{"$f":"B16","v":"jeden tysiąc dwieście PLN 0/100"},null,null,null,"","5 gr","",null,null,"","5 gr",""]
[null,null,null,null,null,null,null,null,null,null,"","2 gr","",null,null,"","2 gr",""]
[null,"Tytuł wpłaty:","Podpis wpłacającego:",null,null,null,"Tytuł wpłaty:","Podpis wpłacającego:",null,null,"","1 gr","",null,null,"","1 gr",""]
[null,"Wpłata z: Katowice, kasa nr 26","Pieprzak Grzegorz",null,null,null,{"$f":"B19","v":"Wpłata z: Katowice, kasa nr 26"},{"$f":"C19","v":"Pieprzak Grzegorz"}]
[null,"Zmiana nr 42",null,null,null,null,{"$f":"B20","v":"Zmiana nr 42"},null,null,null,null,"Kwota przelewu do banku: ",{"$f":"SUM(M4:M18)","v":1200},null,null,null,"Kwota przelewu do banku: ",{"$f":"SUM(R4:R18)","v":1200}]
[null,"Nr koperty:",null,null,null,null,"Nr koperty:"]
[null,"EMD6388727",null,null,null,null,{"$f":"B22","v":"EMD6388727"},null,null,null,null,null,"specyfikacja",null,null,null,null,"specyfikacja"]
[]
[]
[]
[null,null,null,null,null,null,"rezerwa kasowa"]
[null,"Bankowy dowód wpłaty","mBank S.A."]
[null,"Nazwa i adres właściciela rachunku:",null,null,null,null,"sztuk","nominał","wartość",null,"specyfikacja",3,null,null,null,"specyfikacja"]
[null,{"$f":"B3","v":"PKP Intercity S.A."},null,null,null,null,0,"500 zł",{"$f":"G29*500","v":0},null,"sztuk","nominał","wartość",null,null,"sztuk","nominał","wartość"]
[null,{"$f":"B4","v":"Aleje Jerozolimskie 142A, 02-305 Warszawa"},null,null,null,null,0,"200 zł",{"$f":"G30*200","v":0},null,{"$f":"IF(K4=\"\",\"\",K4)","v":""},"500 zł",{"$f":"IF(K30=\"\",\"\",K30*L30)","v":""},null,null,{"$f":"IF(P4=\"\",\"\",P4)","v":""},"500 zł",{"$f":"IF(P30=\"\",\"\",P30*Q30)","v":""}]
[null,null,null,null,null,null,0,"100 zł",{"$f":"G31*100","v":0},null,3,"200 zł",{"$f":"IF(K31=\"\",\"\",K31*L31)","v":600},null,null,3,"200 zł",{"$f":"IF(P31=\"\",\"\",P31*Q31)","v":600}]
[null,"Nazwa i adres wpłacającego:",null,null,null,null,0,"50 zł",{"$f":"G32*50","v":0},null,6,"100 zł",600,null,null,6,"100 zł",600]
[null,{"$f":"B7","v":"Pieprzak Grzegorz"},null,null,null,null,0,"20 zł",{"$f":"G33*20","v":0},null,"","50 zł","",null,null,"","50 zł",""]
[null,null,null,null,null,null,0,"10 zł",{"$f":"G34*10","v":0},null,"","20 zł","",null,null,"","20 zł",""]
[null,"Nr rachunku:","Data wpłaty:",null,null,null,0,"5 zł",{"$f":"G35*5","v":0},null,"","10 zł","",null,null,"","10 zł",""]
[null,{"$f":"B10","v":"84 1140 1010 4167 0000 0052 2026"},{"$f":"C10","v":"2024-03-14"},null,null,null,0,"2 zł",{"$f":"G36*2","v":0},null,"","5 zł","",null,null,"","5 zł",""]
[null,null,null,null,null,null,0,"1 zł",{"$f":"G37*1","v":0},null,"","2 zł","",null,null,"","2 zł",""]
[null,"Kwota wpłaty:",null,"Waluta:",null,null,0,"50 gr",{"$f":"G38*0.5","v":0},null,"","1 zł","",null,null,"","1 zł",""]
[null,{"$f":"B13","v":1200},null,"PLN",null,null,0,"20 gr",{"$f":"G39*0.2","v":0},null,"","50 gr","",null,null,"","50 gr",""]
[null,null,null,null,null,null,0,"10 gr",{"$f":"G40*0.1","v":0},null,"","20 gr","",null,null,"","20 gr",""]
[null,"Kwota słownie:",null,null,null,null,0,"5 gr",{"$f":"G41*0.05","v":0},null,"","10 gr","",null,null,"","10 gr",""]
[null,{"$f":"B16","v":"jeden tysiąc dwieście PLN 0/100"},null,null,null,null,0,"2 gr",{"$f":"G42*0.02","v":0},null,"","5 gr","",null,null,"","5 gr",""]
[null,null,null,null,null,null,0,"1 gr",{"$f":"G43*0.01","v":0},null,"","2 gr","",null,null,"","2 gr",""]
[null,"Tytuł wpłaty:","Podpis wpłacającego:",null,null,null,"kwota w bilonie:",null,null,null,"","1 gr","",null,null,"","1 gr",""]
[null,{"$f":"B19","v":"Wpłata z: Katowice, kasa nr 26"},{"$f":"C19","v":"Pieprzak Grzegorz"},null,null,null,null,"Pozostałość wyliczona: ",{"$f":"SUM(I29:I43)","v":0}]
[null,{"$f":"B20","v":"Zmiana nr 42"},null,null,null,null,"całkowita kwota przelewu do banku:","Pozostałość kasowa rPOS: ",null,null,null,"Kwota przelewu do banku: ",{"$f":"SUM(M30:M44)","v":1200},null,null,null,"Kwota przelewu do banku: ",{"$f":"SUM(R30:R44)","v":1200}]
[null,"Nr koperty:",null,null,null,null,null,"Różnica PW-PK: ",{"$f":"IF(H47=\"\",\"\",I45-I46)","v":0}]
[null,{"$f":"B22","v":"EMD6388727"},null,null,null,null,null,"rezerwa kasowa",null,null,null,null,"specyfikacja",null,null,null,null,"specyfikacja"]
[]
[]
[]
[null,"specyfikacja",null,null,null,null,"specyfikacja"]
[null,"sztuk","nominał","wartość",null,null,"sztuk","nominał","wartość"]
[null,null,"500 zł",{"$f":"IF(B54=\"\",\"\",B54*C54)","v":""},null,null,{"$f":"IF(B54=\"\",\"\",B54)","v":""},"500 zł",{"$f":"IF(G54=\"\",\"\",G54*H54)","v":""}]
[null,3,"200 zł",{"$f":"IF(B55=\"\",\"\",B55*C55)","v":600},null,null,{"$f":"IF(B55=\"\",\"\",B55)","v":3},"200 zł",{"$f":"IF(G55=\"\",\"\",G55*H55)","v":600}]
[null,6,"100 zł",600,null,null,6,"100 zł",600]
[null,null,"50 zł","",null,null,"","50 zł",""]
[null,null,"20 zł","",null,null,"","20 zł",""]
[null,null,"10 zł","",null,null,"","10 zł",""]
[null,null,"5 zł","",null,null,"","5 zł",""]
[null,null,"2 zł","",null,null,"","2 zł",""]
[null,null,"1 zł","",null,null,"","1 zł",""]
[null,null,"50 gr","",null,null,"","50 gr",""]
[null,null,"20 gr","",null,null,"","20 gr",""]
[null,null,"10 gr","",null,null,"","10 gr",""]
[null,null,"5 gr","",null,null,"","5 gr",""]
[null,null,"2 gr","",null,null,"","2 gr",""]
[null,null,"1 gr","",null,null,"","1 gr",""]
[]
[null,null,"Kwota przelewu do banku: ",{"$f":"SUM(D54:D68)","v":1200},null,null,null,"Kwota przelewu do banku: ",{"$f":"SUM(I54:I68)","v":1200}]
[]
[null,null,null,"specyfikacja",null,null,null,null,"specyfikacja"]
[]
[]
[]
[]
[]
[null,"specyfikacja",null,null,null,null,"specyfikacja"]
[null,"sztuk","nominał","wartość",null,null,"sztuk","nominał","wartość"]
[null,{"$f":"IF(B54=\"\",\"\",B54)","v":""},"500 zł",{"$f":"IF(B80=\"\",\"\",B80*C80)","v":""},null,null,{"$f":"IF(G54=\"\",\"\",G54)","v":""},"500 zł",{"$f":"IF(G80=\"\",\"\",G80*H80)","v":""}]
[null,3,"200 zł",{"$f":"IF(B81=\"\",\"\",B81*C81)","v":600},null,null,3,"200 zł",{"$f":"IF(G81=\"\",\"\",G81*H81)","v":600}]
[null,6,"100 zł",600,null,null,6,"100 zł",600]
[null,"","50 zł","",null,null,"","50 zł",""]
[null,"","20 zł","",null,null,"","20 zł",""]
[null,"","10 zł","",null,null,"","10 zł",""]
[null,"","5 zł","",null,null,"","5 zł",""]
[null,"","2 zł","",null,null,"","2 zł",""]
[null,"","1 zł","",null,null,"","1 zł",""]
[null,"","50 gr","",null,null,"","50 gr",""]
[null,"","20 gr","",null,null,"","20 gr",""]
[null,"","10 gr","",null,null,"","10 gr",""]
[null,"","5 gr","",null,null,"","5 gr",""]
[null,"","2 gr","",null,null,"","2 gr",""]
[null,"","1 gr","",null,null,"","1 gr",""]
[]
[null,null,"Kwota przelewu do banku: ",{"$f":"SUM(D80:D94)","v":1200},null,null,null,"Kwota przelewu do banku: ",{"$f":"SUM(I80:I94)","v":1200}]
[]
[null,null,null,"specyfikacja",null,null,null,null,"specyfikacja"]

{"sheet":"mBank","index":6,"n_rows":48,"n_cols":7,"rows_kept":48,"cut":false,"hidden":true,"merged":[[1,5,1,6],[2,5,2,6],[3,4,3,6],[4,4,4,6],[7,4,8,6],[29,4,29,6],[11,1,12,1],[13,4,14,5],[13,6,14,6],[14,1,15,1],[16,4,17,6],[18,5,18,6],[10,4,11,4],[10,5,11,6],[19,5,23,6],[24,4,24,6],[26,5,26,6],[27,5,27,6],[28,4,28,6],[42,5,42,6],[43,5,47,6],[31,4,32,6],[34,4,35,4],[34,5,35,6],[37,4,38,5],[37,6,38,6],[40,4,41,6]]}
[]
[null,null,null,null,"Bankowy dowód wpłaty","mBank S.A."]
["WPROWADZANIE DANYCH DO BDW",null,null,null,"Nazwa i adres właściciela rachunku:"]
[null,null,null,null,{"$f":"UPPER('BDW(4)'!B3)","v":"PKP INTERCITY S.A."}]
["Nr kasy:","Jarosław, kasa nr 04",null,null,{"$f":"UPPER('BDW(4)'!B4)","v":"ALEJE JEROZOLIMSKIE 142A, 02-305 WARSZAWA"}]
[null,"08"]
[null,null,null,null,"Nazwa i adres wpłacającego:"]
["Data wpłaty:","2021-05-10",null,null,{"$f":"'BDW(4)'!B7","v":"Pieprzak Grzegorz"}]
[]
["Kwota wpłaty:",116,null,null,"Nr rachunku:","Data wpłaty:"]
[null,null,null,null,{"$f":"'BDW(4)'!B10","v":"84 1140 1010 4167 0000 0052 2026"},{"$f":"'BDW(4)'!C10","v":"2024-03-14"}]
["Tytuł wpłaty:",{"$f":"CONCATENATE(\"Wpłata z: \",B5)","v":"Wpłata z: Jarosław, kasa nr 04"}]
[null,null,null,null,"Kwota wpłaty:",null,"Waluta:"]
[null,null,null,null,{"$f":"'BDW(4)'!B13","v":1200},null,"PLN"]
["Wpłacający:","Janina Kowalska"]
[null,null,null,null,"Kwota słownie:"]
[null,null,null,null,{"$f":"'BDW(4)'!B16","v":"jeden tysiąc dwieście PLN 0/100"}]
["Nr koperty:","987654322"]
[null,null,null,null,"Tytuł wpłaty:","Podpis wpłacającego:"]
[null,null,null,null,{"$f":"'BDW(4)'!B45","v":"Wpłata z: Katowice, kasa nr 26"}]
[null,null,null,null,{"$f":"\"Zmiana: ……………….\"&'Dane do wydruku BDW'!D6","v":"Zmiana: ………………."}]
[]
[null,null,null,null,"Nr koperty:"]
[null,null,null,null,{"$f":"'Dane do wydruku BDW'!V13","v":0}]
[]
[]
[null,null,null,null,"Bankowy dowód wpłaty","mBank S.A."]
[null,null,null,null,"Nazwa i adres właściciela rachunku:"]
[null,null,null,null,{"$f":"E4","v":"PKP INTERCITY S.A."}]
[null,null,null,null,{"$f":"E5","v":"ALEJE JEROZOLIMSKIE 142A, 02-305 WARSZAWA"}]
[null,null,null,null,"Nazwa i adres wpłacającego:"]
[null,null,null,null,{"$f":"E8","v":"Pieprzak Grzegorz"}]
[]
[null,null,null,null,"Nr rachunku:","Data wpłaty:"]
[null,null,null,null,{"$f":"E11","v":"84 1140 1010 4167 0000 0052 2026"},{"$f":"F11","v":"2024-03-14"}]
[]
[null,null,null,null,"Kwota wpłaty:",null,"Waluta:"]
[null,null,null,null,{"$f":"E14","v":1200},null,{"$f":"G14","v":"PLN"}]
[]
[null,null,null,null,"Kwota słownie:"]
[null,null,null,null,{"$f":"E17","v":"jeden tysiąc dwieście PLN 0/100"}]
[]
[null,null,null,null,"Tytuł wpłaty:","Podpis wpłacającego:"]
[null,null,null,null,{"$f":"E20","v":"Wpłata z: Katowice, kasa nr 26"}]
[null,null,null,null,{"$f":"E21","v":"Zmiana: ………………."}]
[]
[null,null,null,null,"Nr koperty:"]
[null,null,null,null,{"$f":"E24","v":0}]

{"sheet":"KontaKasowe","index":7,"n_rows":224,"n_cols":21,"rows_kept":224,"cut":false,"hidden":true,"merged":[]}
[null,"Witaj","2024-03-14","mBank S.A.","PKP Intercity S.A.","Sekcja Handlowa w Katowicach","DrukBDW&Raport_v8.24.02.29",null,null,null,null,null,null,null,null,null,null,"Wybrano wysłać: statystyka sprzedaży","[PARAM] ; LOKALIZACJA=151 ; LOKALIZACJAMIASTO=Skarżysko Kamienna ; "]
[null,"Do roboty!",null,{"$f":"IF(ISNUMBER(SEARCH('Dane do wydruku BDW'!$B$3,E5)),MAX($D$4:$D4)+1,0)","v":1},"Aleje Jerozolimskie 142A, 02-305 Warszawa",null,null,null,null,null,"Grzegorz Pieprzak"]
["13/14.03.2024",{"$f":"MAX(Tabela2[Kolumna1])","v":196},"Skarżysko Kamienna, kasa nr 16",{"$f":"LEFT(('Dane do wydruku BDW'!B3),5)","v":""},{"$f":"E1&\"  \" &E2","v":"PKP Intercity S.A.  Aleje Jerozolimskie 142A, 02-305 Warszawa"},{"$f":"_xlfn.IFNA(VLOOKUP(C3,E5:F224,2,FALSE),\"\")","v":"82 1140 1010 4167 0000 0004 5016"},{"$f":"_xlfn.IFNA(VLOOKUP(C3,E5:G224,3,FALSE),\"\")","v":"Skarżysko Kamienna"},{"$f":"_xlfn.IFNA(VLOOKUP(C3,E5:H224,4,FALSE),\"\")","v":"K-16"},{"$f":"_xlfn.IFNA(VLOOKUP(C3,E5:I224,5,FALSE),\"\")","v":"16"},{"$f":"_xlfn.IFNA(VLOOKUP(C3,E5:J224,6,FALSE),\"\")","v":"Sekcja Handlowa w Krakowie"},{"$f":"_xlfn.IFNA(VLOOKUP(C3,E5:K224,7,FALSE),\"\")","v":"08:15 - 20:15"},{"$f":"_xlfn.IFNA(IF(VLOOKUP(C3,E5:L224,8,FALSE)>0,VLOOKUP(C3,E5:L224,8,FALSE),\"brak adresów e-mail w bazie danych\"),\"\")","v":"brak adresów e-mail w bazie danych"},{"$f":"_xlfn.IFNA(IF(VLOOKUP(C3,E5:M224,9,FALSE)>0,VLOOKUP(C3,E5:M224,9,FALSE),\"\"),\"\")","v":""},{"$f":"_xlfn.IFNA(IF(VLOOKUP($C$3,$E$5:N224,10,FALSE)>0,VLOOKUP($C$3,$E$5:N224,10,FALSE),\"brak danych\"),\"\")","v":151},{"$f":"_xlfn.IFNA(IF(VLOOKUP($C$3,$E$5:O224,11,FALSE)>0,VLOOKUP($C$3,$E$5:O224,11,FALSE),\"brak danych\"),\"\")","v":135}]
[null,null,"Wybrane","Kolumna1","Miasto i kasa","Rachunek Collect","Stacja","Nr kasy","nr kasy(2)","Sekcja","godziny dyżuru","wyślij do","czy2zmiana","FakNr","LP"]
[null,null,{"$f":"_xlfn.IFNA(VLOOKUP(ROWS($C$5:$C5),D5:E224,2,FALSE),\"\")","v":"Białystok, kasa nr 02"},{"$f":"IF(ISNUMBER(SEARCH($D$3,E5)),MAX($D$4:$D4)+1,0)","v":1},"Białystok, kasa nr 02","34 1140 1010 4167 0000 0051 4002","Białystok",{"$f":"IF(VALUE(I5)<10,\"K-\"&\"0\"&I5,\"K-\"&I5)","v":"K-02"},"2","Sekcja ","07:00 - 19:00",null,null,"wybierz kasę z listy",1,null,null,"Białystok - kasa konduktorska ","7","Białystok - kasa konduktorska , kasa nr 07","76 1140 1010 4167 0000 0051 4507"]
[null,null,{"$f":"_xlfn.IFNA(VLOOKUP(ROWS($C$5:$C6),D6:E225,2,FALSE),\"\")","v":"Białystok, kasa nr 03"},{"$f":"IF(ISNUMBER(SEARCH($D$3,E6)),MAX($D$4:$D5)+1,0)","v":2},"Białystok, kasa nr 03","07 1140 1010 4167 0000 0051 4003","Białystok",{"$f":"IF(VALUE(I6)<10,\"K-\"&\"0\"&I6,\"K-\"&I6)","v":"K-03"},"3","Sekcja ","07:00 - 19:00",null,null,"wybierz kasę z listy",2,null,null,"Białystok","2","Białystok, kasa nr 02","34 1140 1010 4167 0000 0051 4002"]
[null,null,{"$f":"_xlfn.IFNA(VLOOKUP(ROWS($C$5:$C7),D7:E226,2,FALSE),\"\")","v":"Białystok, kasa nr 04"},{"$f":"IF(ISNUMBER(SEARCH($D$3,E7)),MAX($D$4:$D6)+1,0)","v":3},"Białystok, kasa nr 04","77 1140 1010 4167 0000 0051 4004","Białystok",{"$f":"IF(VALUE(I7)<10,\"K-\"&\"0\"&I7,\"K-\"&I7)","v":"K-04"},"4","Sekcja ","07:00 - 19:00",null,null,"wybierz kasę z listy",3,null,null,"Białystok","3","Białystok, kasa nr 03","07 1140 1010 4167 0000 0051 4003"]
[null,null,{"$f":"_xlfn.IFNA(VLOOKUP(ROWS($C$5:$C8),D8:E227,2,FALSE),\"\")","v":"Białystok, kasa nr 06"},{"$f":"IF(ISNUMBER(SEARCH($D$3,E8)),MAX($D$4:$D7)+1,0)","v":4},"Białystok, kasa nr 06","23 1140 1010 4167 0000 0051 4006","Białystok","K-06","6","Sekcja ","07:00 - 19:00",null,null,"wybierz kasę z listy",4,null,null,"Białystok","4","Białystok, kasa nr 04","77 1140 1010 4167 0000 0051 4004"]
[null,null,{"$f":"_xlfn.IFNA(VLOOKUP(ROWS($C$5:$C9),D9:E228,2,FALSE),\"\")","v":"Białystok, kasa nr 62"},{"$f":"IF(ISNUMBER(SEARCH($D$3,E9)),MAX($D$4:$D8)+1,0)","v":5},"Białystok, kasa nr 62","63 1140 1010 4167 0000 0051 4062","Białystok","K-62","62","Sekcja ","07:00 - 19:00",null,null,"wybierz kasę z listy",5,null,null,"Białystok","6","Białystok, kasa nr 06","23 1140 1010 4167 0000 0051 4006"]
[null,null,{"$f":"_xlfn.IFNA(VLOOKUP(ROWS($C$5:$C10),D10:E229,2,FALSE),\"\")","v":"Białystok, kasa nr 63"},{"$f":"IF(ISNUMBER(SEARCH($D$3,E10)),MAX($D$4:$D9)+1,0)","v":6},"Białystok, kasa nr 63","36 1140 1010 4167 0000 0051 4063","Białystok","K-63","63","Sekcja ","07:00 - 19:00",null,null,"wybierz kasę z listy",6,null,null,"Białystok","62","Białystok, kasa nr 62","63 1140 1010 4167 0000 0051 4062"]
[null,null,{"$f":"_xlfn.IFNA(VLOOKUP(ROWS($C$5:$C11),D11:E230,2,FALSE),\"\")","v":"Bielsko - Biała, kasa nr 32"},{"$f":"IF(ISNUMBER(SEARCH($D$3,E11)),MAX($D$4:$D10)+1,0)","v":7},"Bielsko - Biała, kasa nr 32","19 1140 1010 4167 0000 0052 2032","Bielsko Biała","K-32","32","Sekcja Handlowa w Katowicach","06:00 - 18:00","olga.glab@intercity.pl;anna.jablonska@intercity.pl;zdzislawa.rosochacka@intercity.pl;",null,7,7,null,null,"Białystok","63","Białystok, kasa nr 63","36 1140 1010 4167 0000 0051 4063"]
[null,null,{"$f":"_xlfn.IFNA(VLOOKUP(ROWS($C$5:$C12),D12:E231,2,FALSE),\"\")","v":"Bielsko - Biała, kasa nr 34"},{"$f":"IF(ISNUMBER(SEARCH($D$3,E12)),MAX($D$4:$D11)+1,0)","v":8},"Bielsko - Biała, kasa nr 34","62 1140 1010 4167 0000 0052 2034","Bielsko Biała","K-34","34","Sekcja Handlowa w Katowicach","10:00 - 22:00","olga.glab@intercity.pl;anna.jablonska@intercity.pl;zdzislawa.rosochacka@intercity.pl;",null,8,8,null,null,"Bielsko - Biała","32","Bielsko - Biała, kasa nr 32","19 1140 1010 4167 0000 0052 2032"]
[null,null,{"$f":"_xlfn.IFNA(VLOOKUP(ROWS($C$5:$C13),D13:E232,2,FALSE),\"\")","v":"Bielsko - Biała, kasa nr 53"},{"$f":"IF(ISNUMBER(SEARCH($D$3,E13)),MAX($D$4:$D12)+1,0)","v":9},"Bielsko - Biała, kasa nr 53","34 1140 1010 4167 0000 0052 2053","Bielsko Biała","K-53","53","Sekcja Handlowa w Katowicach","07:00 - 19:00","olga.glab@intercity.pl;anna.jablonska@intercity.pl;zdzislawa.rosochacka@intercity.pl;",null,9,9,null,null,"Bielsko - Biała","34","Bielsko - Biała, kasa nr 34","62 1140 1010 4167 0000 0052 2034"]
[null,null,{"$f":"_xlfn.IFNA(VLOOKUP(ROWS($C$5:$C14),D14:E233,2,FALSE),\"\")","v":"Bochnia, kasa nr 27"},{"$f":"IF(ISNUMBER(SEARCH($D$3,E14)),MAX($D$4:$D13)+1,0)","v":10},"Bochnia, kasa nr 27","91 1140 1010 4167 0000 0052 1027","Bochnia","K-27","27","Sekcja Handlowa w Krakowie","07:00 - 19:00",null,null,"wybierz kasę z listy",10,null,null,"Bielsko - Biała","53","Bielsko - Biała, kasa nr 53","34 1140 1010 4167 0000 0052 2053"]
[null,null,{"$f":"_xlfn.IFNA(VLOOKUP(ROWS($C$5:$C15),D15:E234,2,FALSE),\"\")","v":"Brzeg, kasa nr 24"},{"$f":"IF(ISNUMBER(SEARCH($D$3,E15)),MAX($D$4:$D14)+1,0)","v":11},"Brzeg, kasa nr 24","89 1140 1010 4167 0000 0053 2024","Brzeg","K-24","24","Sekcja ","07:00 - 19:00",null,null,"wybierz kasę z listy",11,null,null,"Bochnia","27","Bochnia, kasa nr 27","91 1140 1010 4167 0000 0052 1027"]
[null,null,{"$f":"_xlfn.IFNA(VLOOKUP(ROWS($C$5:$C16),D16:E235,2,FALSE),\"\")","v":"Bydgoszcz Główna, kasa nr 01"},{"$f":"IF(ISNUMBER(SEARCH($D$3,E16)),MAX($D$4:$D15)+1,0)","v":12},"Bydgoszcz Główna, kasa nr 01","45 1140 1010 4167 0000 0054 3001","Bydgoszcz Główna","K-01","1","Sekcja ","07:00 - 19:00",null,null,"wybierz kasę z listy",12,null,null,"Brzeg","24","Brzeg, kasa nr 24","89 1140 1010 4167 0000 0053 2024"]
[null,null,{"$f":"_xlfn.IFNA(VLOOKUP(ROWS($C$5:$C17),D17:E236,2,FALSE),\"\")","v":"Bydgoszcz Główna, kasa nr 05"},{"$f":"IF(ISNUMBER(SEARCH($D$3,E17)),MAX($D$4:$D16)+1,0)","v":13},"Bydgoszcz Główna, kasa nr 05","34 1140 1010 4167 0000 0054 3005","Bydgoszcz Główna","K-05","5","Sekcja ","07:00 - 19:00",null,null,"wybierz kasę z listy",13,null,null,"Bydgoszcz Główna - kasa konduktorska","3","Bydgoszcz Główna - kasa konduktorska, kasa nr 03","71 1140 1010 4167 0000 0054 3503"]
[null,null,{"$f":"_xlfn.IFNA(VLOOKUP(ROWS($C$5:$C18),D18:E237,2,FALSE),\"\")","v":"Bydgoszcz Główna, kasa nr 06"},{"$f":"IF(ISNUMBER(SEARCH($D$3,E18)),MAX($D$4:$D17)+1,0)","v":14},"Bydgoszcz Główna, kasa nr 06","07 1140 1010 4167 0000 0054 3006","Bydgoszcz Główna","K-06","6","Sekcja ","07:00 - 19:00",null,null,"wybierz kasę z listy",14,null,null,"Bydgoszcz Główna","1","Bydgoszcz Główna, kasa nr 01","45 1140 1010 4167 0000 0054 3001"]
[null,null,{"$f":"_xlfn.IFNA(VLOOKUP(ROWS($C$5:$C19),D19:E238,2,FALSE),\"\")","v":"Bydgoszcz Główna, kasa nr 10"},{"$f":"IF(ISNUMBER(SEARCH($D$3,E19)),MAX($D$4:$D18)+1,0)","v":15},"Bydgoszcz Główna, kasa nr 10","93 1140 1010 4167 0000 0054 3010","Bydgoszcz Główna","K-10","10","Sekcja ","07:00 - 19:00",null,null,"wybierz kasę z listy",15,null,null,"Bydgoszcz Główna","5","Bydgoszcz Główna, kasa nr 05","34 1140 1010 4167 0000 0054 3005"]
[null,null,{"$f":"_xlfn.IFNA(VLOOKUP(ROWS($C$5:$C20),D20:E239,2,FALSE),\"\")","v":"Choszczno, kasa nr 24"},{"$f":"IF(ISNUMBER(SEARCH($D$3,E20)),MAX($D$4:$D19)+1,0)","v":16},"Choszczno, kasa nr 24","40 1140 1010 4167 0000 0054 2024","Choszczno","K-24","24","Sekcja ","07:00 - 19:00",null,null,"wybierz kasę z listy",16,null,null,"Bydgoszcz Główna","6","Bydgoszcz Główna, kasa nr 06","07 1140 1010 4167 0000 0054 3006"]
[null,null,{"$f":"_xlfn.IFNA(VLOOKUP(ROWS($C$5:$C21),D21:E240,2,FALSE),\"\")","v":"Czechowice Dziedzice, kasa nr 35"},{"$f":"IF(ISNUMBER(SEARCH($D$3,E21)),MAX($D$4:$D20)+1,0)","v":17},"Czechowice Dziedzice, kasa nr 35","54 1140 1010 4167 0000 0004 5035","Czechowice Dziedzice","K-35","35","Sekcja Handlowa w Katowicach","07:00 - 19:00","olga.glab@intercity.pl;anna.jablonska@intercity.pl;zdzislawa.rosochacka@intercity.pl;",null,"wybierz kasę z listy",17,null,null,"Bydgoszcz Główna","10","Bydgoszcz Główna, kasa nr 10","93 1140 1010 4167 0000 0054 3010"]
[null,null,{"$f":"_xlfn.IFNA(VLOOKUP(ROWS($C$5:$C22),D22:E241,2,FALSE),\"\")","v":"Częstochowa Stradom, kasa nr 15"},{"$f":"IF(ISNUMBER(SEARCH($D$3,E22)),MAX($D$4:$D21)+1,0)","v":18},"Częstochowa Stradom, kasa nr 15","12 1140 1010 4167 0000 0004 5015","Częstochowa Stradom","K-15","15","Sekcja Handlowa w Katowicach","05:30 - 13:30","olga.glab@intercity.pl;anna.jablonska@intercity.pl;zdzislawa.rosochacka@intercity.pl;","13:00 - 21:00",19,18,null,null,"Bytom","42","Bytom, kasa nr 42","40 1140 1010 4167 0000 0052 2042"]
[null,null,{"$f":"_xlfn.IFNA(VLOOKUP(ROWS($C$5:$C23),D23:E242,2,FALSE),\"\")","v":"Częstochowa, kasa nr 39"},{"$f":"IF(ISNUMBER(SEARCH($D$3,E23)),MAX($D$4:$D22)+1,0)","v":19},"Częstochowa, kasa nr 39","24 1140 1010 4167 0000 0052 2039","Częstochowa","K-39","39","Sekcja Handlowa w Katowicach","07:00 - 19:00","olga.glab@intercity.pl;anna.jablonska@intercity.pl;zdzislawa.rosochacka@intercity.pl;",null,16,19,null,null,"Choszczno","24","Choszczno, kasa nr 24","40 1140 1010 4167 0000 0054 2024"]
[null,null,{"$f":"_xlfn.IFNA(VLOOKUP(ROWS($C$5:$C24),D24:E243,2,FALSE),\"\")","v":"Częstochowa, kasa nr 40"},{"$f":"IF(ISNUMBER(SEARCH($D$3,E24)),MAX($D$4:$D23)+1,0)","v":20},"Częstochowa, kasa nr 40","94 1140 1010 4167 0000 0052 2040","Częstochowa","K-40","40","Sekcja Handlowa w Katowicach","09:30 - 21:30","olga.glab@intercity.pl;anna.jablonska@intercity.pl;zdzislawa.rosochacka@intercity.pl;",null,18,20,null,null,"Czechowice Dziedzice","35","Czechowice Dziedzice, kasa nr 35","54 1140 1010 4167 0000 0004 5035"]
[null,null,{"$f":"_xlfn.IFNA(VLOOKUP(ROWS($C$5:$C25),D25:E244,2,FALSE),\"\")","v":"Częstochowa, kasa nr 54"},{"$f":"IF(ISNUMBER(SEARCH($D$3,E25)),MAX($D$4:$D24)+1,0)","v":21},"Częstochowa, kasa nr 54","07 1140 1010 4167 0000 0052 2054","Częstochowa","K-54","54","Sekcja Handlowa w Katowicach","06:10 - 14:10","olga.glab@intercity.pl;anna.jablonska@intercity.pl;zdzislawa.rosochacka@intercity.pl;","13:30 - 21:30",17,21,null,null,"Częstochowa - kasa konduktorska","04","Częstochowa - kasa konduktorska, kasa nr 04","79 1140 1010 4167 0000 0052 2504"]
[null,null,{"$f":"_xlfn.IFNA(VLOOKUP(ROWS($C$5:$C26),D26:E245,2,FALSE),\"\")","v":"Dębica, kasa nr 07"},{"$f":"IF(ISNUMBER(SEARCH($D$3,E26)),MAX($D$4:$D25)+1,0)","v":22},"Dębica, kasa nr 07","78 1140 1010 4167 0000 0052 3007","Dębica","K-07",7,"Sekcja Handlowa w Przemyślu","06:00 - 14:00","Malgorzata.Brzezawska@intercity.pl",null,20,22,null,null,"Częstochowa Stradom","15","Częstochowa Stradom, kasa nr 15","12 1140 1010 4167 0000 0004 5015"]
[null,null,{"$f":"_xlfn.IFNA(VLOOKUP(ROWS($C$5:$C27),D27:E246,2,FALSE),\"\")","v":"Elbląg, kasa nr 10"},{"$f":"IF(ISNUMBER(SEARCH($D$3,E27)),MAX($D$4:$D26)+1,0)","v":23},"Elbląg, kasa nr 10","59 1140 1010 4167 0000 0054 4010","Elbląg ","K-10","10","Sekcja ","07:00 - 19:00",null,null,"wybierz kasę z listy",23,null,null,"Częstochowa","39","Częstochowa, kasa nr 39","24 1140 1010 4167 0000 0052 2039"]
[null,null,{"$f":"_xlfn.IFNA(VLOOKUP(ROWS($C$5:$C28),D28:E247,2,FALSE),\"\")","v":"Elbląg, kasa nr 11"},{"$f":"IF(ISNUMBER(SEARCH($D$3,E28)),MAX($D$4:$D27)+1,0)","v":24},"Elbląg, kasa nr 11","32 1140 1010 4167 0000 0054 4011","Elbląg ","K-11","11","Sekcja ","07:00 - 19:00",null,null,"wybierz kasę z listy",24,null,null,"Częstochowa","40","Częstochowa, kasa nr 40","94 1140 1010 4167 0000 0052 2040"]
[null,null,{"$f":"_xlfn.IFNA(VLOOKUP(ROWS($C$5:$C29),D29:E248,2,FALSE),\"\")","v":"Ełk, kasa nr 01"},{"$f":"IF(ISNUMBER(SEARCH($D$3,E29)),MAX($D$4:$D28)+1,0)","v":25},"Ełk, kasa nr 01","02 1140 1010 4167 0000 0004 5001","Ełk","K-01",1,"Sekcja ","07:00 - 19:00",null,null,"wybierz kasę z listy",25,null,null,"Częstochowa","54","Częstochowa, kasa nr 54","07 1140 1010 4167 0000 0052 2054"]
[null,null,{"$f":"_xlfn.IFNA(VLOOKUP(ROWS($C$5:$C30),D30:E252,2,FALSE),\"\")","v":"Gdańsk Główny, kasa nr 04"},{"$f":"IF(ISNUMBER(SEARCH($D$3,E30)),MAX($D$4:$D29)+1,0)","v":26},"Gdańsk Główny, kasa nr 04","32 1140 1010 4167 0000 0054 1004","Gdańsk Główny","K-04","4","Sekcja ","07:00 - 19:00",null,null,"wybierz kasę z listy",29,null,null,"Ełk","01","Ełk, kasa nr 01","02 1140 1010 4167 0000 0004 5001"]
[null,null,{"$f":"_xlfn.IFNA(VLOOKUP(ROWS($C$5:$C31),D31:E253,2,FALSE),\"\")","v":"Gdańsk Główny, kasa nr 06"},{"$f":"IF(ISNUMBER(SEARCH($D$3,E31)),MAX($D$4:$D30)+1,0)","v":27},"Gdańsk Główny, kasa nr 06","75 1140 1010 4167 0000 0054 1006","Gdańsk Główny","K-06","6","Sekcja ","07:00 - 19:00",null,null,"wybierz kasę z listy",30,null,null,"Gdańsk Główny - Centrum Obsługi Klienta","COK 01","Gdańsk Główny - Centrum Obsługi Klienta, kasa nr COK 01","16 1140 1010 4167 0000 0054 1001"]
[null,null,{"$f":"_xlfn.IFNA(VLOOKUP(ROWS($C$5:$C32),D32:E254,2,FALSE),\"\")","v":"Gdańsk Główny, kasa nr 09"},{"$f":"IF(ISNUMBER(SEARCH($D$3,E32)),MAX($D$4:$D31)+1,0)","v":28},"Gdańsk Główny, kasa nr 09","91 1140 1010 4167 0000 0054 1009","Gdańsk Główny","K-09","9","Sekcja ","07:00 - 19:00",null,null,"wybierz kasę z listy",31,null,null,"Gdańsk Główny - Centrum Obsługi Klienta","COK 13","Gdańsk Główny - Centrum Obsługi Klienta, kasa nr COK 13","80 1140 1010 4167 0000 0054 1013"]
[null,null,{"$f":"_xlfn.IFNA(VLOOKUP(ROWS($C$5:$C33),D33:E255,2,FALSE),\"\")","v":"Gdańsk Główny, kasa nr 10"},{"$f":"IF(ISNUMBER(SEARCH($D$3,E33)),MAX($D$4:$D32)+1,0)","v":29},"Gdańsk Główny, kasa nr 10","64 1140 1010 4167 0000 0054 1010","Gdańsk Główny","K-10","10","Sekcja ","07:00 - 19:00",null,null,"wybierz kasę z listy",32,null,null,"Gdańsk Główny - Centrum Obsługi Klienta","COK 17","Gdańsk Główny - Centrum Obsługi Klienta, kasa nr COK 17","69 1140 1010 4167 0000 0054 1017"]
[null,null,{"$f":"_xlfn.IFNA(VLOOKUP(ROWS($C$5:$C34),D34:E256,2,FALSE),\"\")","v":"Gdańsk Główny, kasa nr 16"},{"$f":"IF(ISNUMBER(SEARCH($D$3,E34)),MAX($D$4:$D33)+1,0)","v":30},"Gdańsk Główny, kasa nr 16","96 1140 1010 4167 0000 0054 1016","Gdańsk Główny","K-16","16","Sekcja ","07:00 - 19:00",null,null,"wybierz kasę z listy",33,null,null,"Gdańsk Główny","4","Gdańsk Główny, kasa nr 04","32 1140 1010 4167 0000 0054 1004"]
[null,null,{"$f":"_xlfn.IFNA(VLOOKUP(ROWS($C$5:$C35),D35:E257,2,FALSE),\"\")","v":"Gdańsk Główny, kasa nr 31"},{"$f":"IF(ISNUMBER(SEARCH($D$3,E35)),MAX($D$4:$D34)+1,0)","v":31},"Gdańsk Główny, kasa nr 31","79 1140 1010 4167 0000 0054 1031","Gdańsk Główny","K-31","31","Sekcja ","07:00 - 19:00",null,null,"wybierz kasę z listy",34,null,null,"Gdańsk Główny","6","Gdańsk Główny, kasa nr 06","75 1140 1010 4167 0000 0054 1006"]
[null,null,{"$f":"_xlfn.IFNA(VLOOKUP(ROWS($C$5:$C36),D36:E258,2,FALSE),\"\")","v":"Gdańsk Oliwa, kasa nr 29"},{"$f":"IF(ISNUMBER(SEARCH($D$3,E36)),MAX($D$4:$D35)+1,0)","v":32},"Gdańsk Oliwa, kasa nr 29","31 1140 1010 4167 0000 0054 4029","Gdańsk Oliwa","K-29","29","Sekcja ","07:00 - 19:00",null,null,"wybierz kasę z listy",35,null,null,"Gdańsk Główny","9","Gdańsk Główny, kasa nr 09","91 1140 1010 4167 0000 0054 1009"]
[null,null,{"$f":"_xlfn.IFNA(VLOOKUP(ROWS($C$5:$C37),D37:E259,2,FALSE),\"\")","v":"Gdańsk Wrzeszcz, kasa nr 24"},{"$f":"IF(ISNUMBER(SEARCH($D$3,E37)),MAX($D$4:$D36)+1,0)","v":33},"Gdańsk Wrzeszcz, kasa nr 24","98 1140 1010 4167 0000 0054 6024","Gdańsk Wrzeszcz","K-24","24","Sekcja ","07:00 - 19:00",null,null,"wybierz kasę z listy",36,null,null,"Gdańsk Główny","10","Gdańsk Główny, kasa nr 10","64 1140 1010 4167 0000 0054 1010"]
[null,null,{"$f":"_xlfn.IFNA(VLOOKUP(ROWS($C$5:$C38),D38:E260,2,FALSE),\"\")","v":"Gdynia Gł, kasa nr 02"},{"$f":"IF(ISNUMBER(SEARCH($D$3,E38)),MAX($D$4:$D37)+1,0)","v":34},"Gdynia Gł, kasa nr 02","86 1140 1010 4167 0000 0054 1002","Gdynia Gł","K-02","2","Sekcja ","07:00 - 19:00",null,null,"wybierz kasę z listy",37,null,null,"Gdańsk Główny","16","Gdańsk Główny, kasa nr 16","96 1140 1010 4167 0000 0054 1016"]
[null,null,{"$f":"_xlfn.IFNA(VLOOKUP(ROWS($C$5:$C39),D39:E261,2,FALSE),\"\")","v":"Gdynia Gł, kasa nr 07"},{"$f":"IF(ISNUMBER(SEARCH($D$3,E39)),MAX($D$4:$D38)+1,0)","v":35},"Gdynia Gł, kasa nr 07","48 1140 1010 4167 0000 0054 1007","Gdynia Gł","K-07","7","Sekcja ","07:00 - 19:00",null,null,"wybierz kasę z listy",38,null,null,"Gdańsk Główny","31","Gdańsk Główny, kasa nr 31","79 1140 1010 4167 0000 0054 1031"]
[null,null,{"$f":"_xlfn.IFNA(VLOOKUP(ROWS($C$5:$C40),D40:E262,2,FALSE),\"\")","v":"Gdynia Gł, kasa nr 08"},{"$f":"IF(ISNUMBER(SEARCH($D$3,E40)),MAX($D$4:$D39)+1,0)","v":36},"Gdynia Gł, kasa nr 08","21 1140 1010 4167 0000 0054 1008","Gdynia Gł","K-08","8","Sekcja ","07:00 - 19:00",null,null,"wybierz kasę z listy",39,null,null,"Gdańsk Oliwa","29","Gdańsk Oliwa, kasa nr 29","31 1140 1010 4167 0000 0054 4029"]
[null,null,{"$f":"_xlfn.IFNA(VLOOKUP(ROWS($C$5:$C41),D41:E263,2,FALSE),\"\")","v":"Gdynia Gł, kasa nr 19"},{"$f":"IF(ISNUMBER(SEARCH($D$3,E41)),MAX($D$4:$D40)+1,0)","v":37},"Gdynia Gł, kasa nr 19","15 1140 1010 4167 0000 0054 1019","Gdynia Gł","K-19","19","Sekcja ","07:00 - 19:00",null,null,"wybierz kasę z listy",40,null,null,"Gdańsk Wrzeszcz","24","Gdańsk Wrzeszcz, kasa nr 24","98 1140 1010 4167 0000 0054 6024"]
[null,null,{"$f":"_xlfn.IFNA(VLOOKUP(ROWS($C$5:$C42),D42:E264,2,FALSE),\"\")","v":"Gdynia Gł, kasa nr 20"},{"$f":"IF(ISNUMBER(SEARCH($D$3,E42)),MAX($D$4:$D41)+1,0)","v":38},"Gdynia Gł, kasa nr 20","85 1140 1010 4167 0000 0054 1020","Gdynia Gł","K-20","20","Sekcja ","07:00 - 19:00",null,null,"wybierz kasę z listy",41,null,null,"Gdynia Gł","01","Gdynia Gł, kasa nr 01","42 1140 1010 4167 0000 0054 1503"]
[null,null,{"$f":"_xlfn.IFNA(VLOOKUP(ROWS($C$5:$C43),D43:E265,2,FALSE),\"\")","v":"Gdynia Gł, kasa nr 25"},{"$f":"IF(ISNUMBER(SEARCH($D$3,E43)),MAX($D$4:$D42)+1,0)","v":39},"Gdynia Gł, kasa nr 25","47 1140 1010 4167 0000 0054 1025","Gdynia Gł","K-25","25","Sekcja ","07:00 - 19:00",null,null,"wybierz kasę z listy",42,null,null,"Gdynia Gł","2","Gdynia Gł, kasa nr 02","86 1140 1010 4167 0000 0054 1002"]
[null,null,{"$f":"_xlfn.IFNA(VLOOKUP(ROWS($C$5:$C44),D44:E266,2,FALSE),\"\")","v":"Gdynia Gł, kasa nr 41"},{"$f":"IF(ISNUMBER(SEARCH($D$3,E44)),MAX($D$4:$D43)+1,0)","v":40},"Gdynia Gł, kasa nr 41","23 1140 1010 4167 0000 0004 4041","Gdynia Gł","K-41","41","Sekcja ","07:00 - 19:00",null,null,"wybierz kasę z listy",43,null,null,"Gdynia Gł","7","Gdynia Gł, kasa nr 07","48 1140 1010 4167 0000 0054 1007"]
[null,null,{"$f":"_xlfn.IFNA(VLOOKUP(ROWS($C$5:$C45),D45:E267,2,FALSE),\"\")","v":"Gliwice, kasa nr 06"},{"$f":"IF(ISNUMBER(SEARCH($D$3,E45)),MAX($D$4:$D44)+1,0)","v":41},"Gliwice, kasa nr 06","42 1140 1010 4167 0000 0052 2006","Gliwice","K-06","6","Sekcja Handlowa w Katowicach","07:00 - 19:00","olga.glab@intercity.pl;anna.jablonska@intercity.pl;zdzislawa.rosochacka@intercity.pl;",null,45,44,null,null,"Gdynia Gł","8","Gdynia Gł, kasa nr 08","21 1140 1010 4167 0000 0054 1008"]
[null,null,{"$f":"_xlfn.IFNA(VLOOKUP(ROWS($C$5:$C46),D46:E268,2,FALSE),\"\")","v":"Gliwice, kasa nr 13"},{"$f":"IF(ISNUMBER(SEARCH($D$3,E46)),MAX($D$4:$D45)+1,0)","v":42},"Gliwice, kasa nr 13","47 1140 1010 4167 0000 0052 2013","Gliwice","K-13","13","Sekcja Handlowa w Katowicach","05:00 - 13:00","olga.glab@intercity.pl;anna.jablonska@intercity.pl;zdzislawa.rosochacka@intercity.pl;",null,46,45,null,null,"Gdynia Gł","19","Gdynia Gł, kasa nr 19","15 1140 1010 4167 0000 0054 1019"]
[null,null,{"$f":"_xlfn.IFNA(VLOOKUP(ROWS($C$5:$C47),D47:E269,2,FALSE),\"\")","v":"Gliwice, kasa nr 43"},{"$f":"IF(ISNUMBER(SEARCH($D$3,E47)),MAX($D$4:$D46)+1,0)","v":43},"Gliwice, kasa nr 43","13 1140 1010 4167 0000 0052 2043","Gliwice","K-43","43","Sekcja Handlowa w Katowicach","07:00 - 19:00","olga.glab@intercity.pl;anna.jablonska@intercity.pl;zdzislawa.rosochacka@intercity.pl;",null,"wybierz kasę z listy",46,null,null,"Gdynia Gł","20","Gdynia Gł, kasa nr 20","85 1140 1010 4167 0000 0054 1020"]
[null,null,{"$f":"_xlfn.IFNA(VLOOKUP(ROWS($C$5:$C48),D48:E270,2,FALSE),\"\")","v":"Gniezno, kasa nr 09"},{"$f":"IF(ISNUMBER(SEARCH($D$3,E48)),MAX($D$4:$D47)+1,0)","v":44},"Gniezno, kasa nr 09","43 1140 1010 4167 0000 0053 1009","Gniezno","K-09",9,"Sekcja ","07:00 - 19:00",null,null,"wybierz kasę z listy",47,null,null,"Gdynia Gł","25","Gdynia Gł, kasa nr 25","47 1140 1010 4167 0000 0054 1025"]
[null,null,{"$f":"_xlfn.IFNA(VLOOKUP(ROWS($C$5:$C49),D49:E271,2,FALSE),\"\")","v":"Iława Główna, kasa nr 02"},{"$f":"IF(ISNUMBER(SEARCH($D$3,E49)),MAX($D$4:$D48)+1,0)","v":45},"Iława Główna, kasa nr 02","81 1140 1010 4167 0000 0054 4002","Iława Główna","K-02","2","Sekcja ","07:00 - 19:00",null,null,"wybierz kasę z listy",48,null,null,"Gdynia Gł","41","Gdynia Gł, kasa nr 41","23 1140 1010 4167 0000 0004 4041"]
[null,null,{"$f":"_xlfn.IFNA(VLOOKUP(ROWS($C$5:$C50),D50:E272,2,FALSE),\"\")","v":"Iława Główna, kasa nr 24"},{"$f":"IF(ISNUMBER(SEARCH($D$3,E50)),MAX($D$4:$D49)+1,0)","v":46},"Iława Główna, kasa nr 24","69 1140 1010 4167 0000 0054 4024","Iława Główna","K-24","24","Sekcja ","07:00 - 19:00",null,null,"wybierz kasę z listy",49,null,null,"Gliwice","6","Gliwice, kasa nr 06","42 1140 1010 4167 0000 0052 2006"]
[null,null,{"$f":"_xlfn.IFNA(VLOOKUP(ROWS($C$5:$C51),D51:E273,2,FALSE),\"\")","v":"Jarosław, kasa nr 04"},{"$f":"IF(ISNUMBER(SEARCH($D$3,E51)),MAX($D$4:$D50)+1,0)","v":47},"Jarosław, kasa nr 04","87 1140 1010 4167 0000 0002 3004","Jarosław","K-04","4","Sekcja Handlowa w Przemyślu","09:00 - 17:00","Malgorzata.Brzezawska@intercity.pl",null,"??????????",50,null,null,"Gliwice","13","Gliwice, kasa nr 13","47 1140 1010 4167 0000 0052 2013"]
[null,null,{"$f":"_xlfn.IFNA(VLOOKUP(ROWS($C$5:$C52),D52:E274,2,FALSE),\"\")","v":"Jarosław, kasa nr 08"},{"$f":"IF(ISNUMBER(SEARCH($D$3,E52)),MAX($D$4:$D51)+1,0)","v":48},"Jarosław, kasa nr 08","51 1140 1010 4167 0000 0052 3008","Jarosław","K-08","8","Sekcja Handlowa w Przemyślu","07:00 - 19:00","Malgorzata.Brzezawska@intercity.pl",null,335,51,null,null,"Gliwice","43","Gliwice, kasa nr 43","13 1140 1010 4167 0000 0052 2043"]
[null,null,{"$f":"_xlfn.IFNA(VLOOKUP(ROWS($C$5:$C53),D53:E275,2,FALSE),\"\")","v":"Jastarnia, kasa nr 30"},{"$f":"IF(ISNUMBER(SEARCH($D$3,E53)),MAX($D$4:$D52)+1,0)","v":49},"Jastarnia, kasa nr 30","33 1140 1010 4167 0000 0054 6030","Jastarnia","K-30","30","Sekcja ","07:00 - 19:00",null,null,"wybierz kasę z listy",52,null,null,"Gniezno","09","Gniezno, kasa nr 09","43 1140 1010 4167 0000 0053 1009"]
[null,null,{"$f":"_xlfn.IFNA(VLOOKUP(ROWS($C$5:$C54),D54:E276,2,FALSE),\"\")","v":"Jaworsk, kasa nr 08"},{"$f":"IF(ISNUMBER(SEARCH($D$3,E54)),MAX($D$4:$D53)+1,0)","v":50},"Jaworsk, kasa nr 08","51 1140 1010 4167 0000 0052 3008","Jaworsk","K-08",8,"Sekcja ","07:00 - 19:00",null,null,"wybierz kasę z listy",53,null,null,"Iława Główna","2","Iława Główna, kasa nr 02","81 1140 1010 4167 0000 0054 4002"]
[null,null,{"$f":"_xlfn.IFNA(VLOOKUP(ROWS($C$5:$C55),D55:E277,2,FALSE),\"\")","v":"Kalisz, kasa nr 24"},{"$f":"IF(ISNUMBER(SEARCH($D$3,E55)),MAX($D$4:$D54)+1,0)","v":51},"Kalisz, kasa nr 24","26 1140 1010 4167 0000 0053 1024","Kalisz","K-24","24","Sekcja ","07:00 - 19:00",null,null,"wybierz kasę z listy",54,null,null,"Iława Główna","24","Iława Główna, kasa nr 24","69 1140 1010 4167 0000 0054 4024"]
[null,null,{"$f":"_xlfn.IFNA(VLOOKUP(ROWS($C$5:$C56),D56:E278,2,FALSE),\"\")","v":"Katowice, kasa nr 01"},{"$f":"IF(ISNUMBER(SEARCH($D$3,E56)),MAX($D$4:$D55)+1,0)","v":52},"Katowice, kasa nr 01","80 1140 1010 4167 0000 0052 2001","Katowice","K-01","1","Sekcja Handlowa w Katowicach","07:30 - 19:30","olga.glab@intercity.pl;anna.jablonska@intercity.pl;zdzislawa.rosochacka@intercity.pl;",null,56,55,null,null,"Jarosław","4","Jarosław, kasa nr 04","87 1140 1010 4167 0000 0002 3004"]
[null,null,{"$f":"_xlfn.IFNA(VLOOKUP(ROWS($C$5:$C57),D57:E279,2,FALSE),\"\")","v":"Katowice, kasa nr 02"},{"$f":"IF(ISNUMBER(SEARCH($D$3,E57)),MAX($D$4:$D56)+1,0)","v":53},"Katowice, kasa nr 02","53 1140 1010 4167 0000 0052 2002","Katowice","K-02","2","Sekcja Handlowa w Katowicach","05:30 - 13:30","olga.glab@intercity.pl;anna.jablonska@intercity.pl;zdzislawa.rosochacka@intercity.pl;",null,55,56,null,null,"Jarosław","08","Jarosław, kasa nr 08","51 1140 1010 4167 0000 0052 3008"]
[null,null,{"$f":"_xlfn.IFNA(VLOOKUP(ROWS($C$5:$C58),D58:E280,2,FALSE),\"\")","v":"Katowice, kasa nr 03"},{"$f":"IF(ISNUMBER(SEARCH($D$3,E58)),MAX($D$4:$D57)+1,0)","v":54},"Katowice, kasa nr 03","26 1140 1010 4167 0000 0052 2003","Katowice","K-03","3","Sekcja Handlowa w Katowicach","08:00 - 20:00","olga.glab@intercity.pl;anna.jablonska@intercity.pl;zdzislawa.rosochacka@intercity.pl;",null,58,57,null,null,"Jastarnia","30","Jastarnia, kasa nr 30","33 1140 1010 4167 0000 0054 6030"]
[null,null,{"$f":"_xlfn.IFNA(VLOOKUP(ROWS($C$5:$C59),D59:E281,2,FALSE),\"\")","v":"Katowice, kasa nr 04"},{"$f":"IF(ISNUMBER(SEARCH($D$3,E59)),MAX($D$4:$D58)+1,0)","v":55},"Katowice, kasa nr 04","96 1140 1010 4167 0000 0052 2004","Katowice","K-04","4","Sekcja Handlowa w Katowicach","06:00 - 18:00","olga.glab@intercity.pl;anna.jablonska@intercity.pl;zdzislawa.rosochacka@intercity.pl;",null,50,58,null,null,"Kalisz","24","Kalisz, kasa nr 24","26 1140 1010 4167 0000 0053 1024"]
[null,null,{"$f":"_xlfn.IFNA(VLOOKUP(ROWS($C$5:$C60),D60:E282,2,FALSE),\"\")","v":"Katowice, kasa nr 05"},{"$f":"IF(ISNUMBER(SEARCH($D$3,E60)),MAX($D$4:$D59)+1,0)","v":56},"Katowice, kasa nr 05","69 1140 1010 4167 0000 0052 2005","Katowice","K-05","5","Sekcja Handlowa w Katowicach","06:30 - 18:30","olga.glab@intercity.pl;anna.jablonska@intercity.pl;zdzislawa.rosochacka@intercity.pl;",null,51,59,null,null,"Katowice - kasa konduktorska","1","Katowice - kasa konduktorska, kasa nr 01","63 1140 1010 4167 0000 0052 2501"]
[null,null,{"$f":"_xlfn.IFNA(VLOOKUP(ROWS($C$5:$C61),D61:E283,2,FALSE),\"\")","v":"Katowice, kasa nr 12"},{"$f":"IF(ISNUMBER(SEARCH($D$3,E61)),MAX($D$4:$D60)+1,0)","v":57},"Katowice, kasa nr 12","74 1140 1010 4167 0000 0052 2012","Katowice","K-12","12","Sekcja Handlowa w Katowicach","08:00 - 20:00","olga.glab@intercity.pl;anna.jablonska@intercity.pl;zdzislawa.rosochacka@intercity.pl;",null,57,60,null,null,"Katowice","1","Katowice, kasa nr 01","80 1140 1010 4167 0000 0052 2001"]
[null,null,{"$f":"_xlfn.IFNA(VLOOKUP(ROWS($C$5:$C62),D62:E284,2,FALSE),\"\")","v":"Katowice, kasa nr 17"},{"$f":"IF(ISNUMBER(SEARCH($D$3,E62)),MAX($D$4:$D61)+1,0)","v":58},"Katowice, kasa nr 17","36 1140 1010 4167 0000 0052 2017","Katowice","K-17","17","Sekcja Handlowa w Katowicach","07:00 - 19:00","olga.glab@intercity.pl;anna.jablonska@intercity.pl;zdzislawa.rosochacka@intercity.pl;",null,52,61,null,null,"Katowice","2","Katowice, kasa nr 02","53 1140 1010 4167 0000 0052 2002"]
[null,null,{"$f":"_xlfn.IFNA(VLOOKUP(ROWS($C$5:$C63),D63:E285,2,FALSE),\"\")","v":"Katowice, kasa nr 26"},{"$f":"IF(ISNUMBER(SEARCH($D$3,E63)),MAX($D$4:$D62)+1,0)","v":59},"Katowice, kasa nr 26","84 1140 1010 4167 0000 0052 2026","Katowice","K-26","26","Sekcja Handlowa w Katowicach","06:20 - 18:20","olga.glab@intercity.pl;anna.jablonska@intercity.pl;zdzislawa.rosochacka@intercity.pl;",null,53,62,null,null,"Katowice","3","Katowice, kasa nr 03","26 1140 1010 4167 0000 0052 2003"]
[null,null,{"$f":"_xlfn.IFNA(VLOOKUP(ROWS($C$5:$C64),D64:E286,2,FALSE),\"\")","v":"Katowice, kasa nr 28"},{"$f":"IF(ISNUMBER(SEARCH($D$3,E64)),MAX($D$4:$D63)+1,0)","v":60},"Katowice, kasa nr 28","30 1140 1010 4167 0000 0052 2028","Katowice","K-28","28","Sekcja Handlowa w Katowicach","06:30 - 18:30","olga.glab@intercity.pl;anna.jablonska@intercity.pl;zdzislawa.rosochacka@intercity.pl;",null,54,63,null,null,"Katowice","4","Katowice, kasa nr 04","96 1140 1010 4167 0000 0052 2004"]
[null,null,{"$f":"_xlfn.IFNA(VLOOKUP(ROWS($C$5:$C65),D65:E287,2,FALSE),\"\")","v":"Katowice, kasa nr 30"},{"$f":"IF(ISNUMBER(SEARCH($D$3,E65)),MAX($D$4:$D64)+1,0)","v":61},"Katowice, kasa nr 30","73 1140 1010 4167 0000 0052 2030","Katowice","K-30","30","Sekcja Handlowa w Katowicach","08:00 - 20:00","olga.glab@intercity.pl;anna.jablonska@intercity.pl;zdzislawa.rosochacka@intercity.pl;",null,59,64,null,null,"Katowice","5","Katowice, kasa nr 05","69 1140 1010 4167 0000 0052 2005"]
[null,null,{"$f":"_xlfn.IFNA(VLOOKUP(ROWS($C$5:$C66),D66:E288,2,FALSE),\"\")","v":"Kedzierzyn Koźle, kasa nr 31"},{"$f":"IF(ISNUMBER(SEARCH($D$3,E66)),MAX($D$4:$D65)+1,0)","v":62},"Kedzierzyn Koźle, kasa nr 31","46 1140 1010 4167 0000 0052 2031","Kedzierzyn Koźle","K-31","31","Sekcja ","07:00 - 19:00",null,null,"wybierz kasę z listy",65,null,null,"Katowice","12","Katowice, kasa nr 12","74 1140 1010 4167 0000 0052 2012"]
[null,null,{"$f":"_xlfn.IFNA(VLOOKUP(ROWS($C$5:$C67),D67:E289,2,FALSE),\"\")","v":"Kielce, kasa nr 04"},{"$f":"IF(ISNUMBER(SEARCH($D$3,E67)),MAX($D$4:$D66)+1,0)","v":63},"Kielce, kasa nr 04","33 1140 1010 4167 0000 0052 1004","Kielce","K-04","4","Sekcja Handlowa w Krakowie","07:00 - 19:00",null,null,"wybierz kasę z listy",66,null,null,"Katowice","15","Katowice, kasa nr 15","90 1140 1010 4167 0000 0052 2015"]
[null,null,{"$f":"_xlfn.IFNA(VLOOKUP(ROWS($C$5:$C68),D68:E290,2,FALSE),\"\")","v":"Kielce, kasa nr 36"},{"$f":"IF(ISNUMBER(SEARCH($D$3,E68)),MAX($D$4:$D67)+1,0)","v":64},"Kielce, kasa nr 36","42 1140 1010 4167 0000 0052 1036","Kielce",{"$f":"IF(VALUE(I68)<10,\"K-\"&\"0\"&I68,\"K-\"&I68)","v":"K-36"},"36","Sekcja Handlowa w Krakowie","07:00 - 19:00",null,null,"wybierz kasę z listy",67,null,null,"Katowice","17","Katowice, kasa nr 17","36 1140 1010 4167 0000 0052 2017"]
[null,null,{"$f":"_xlfn.IFNA(VLOOKUP(ROWS($C$5:$C69),D69:E291,2,FALSE),\"\")","v":"Kielce, kasa nr 64"},{"$f":"IF(ISNUMBER(SEARCH($D$3,E69)),MAX($D$4:$D68)+1,0)","v":65},"Kielce, kasa nr 64","62 1140 1010 4167 0000 0052 1064","Kielce","K-64","64","Sekcja Handlowa w Krakowie","07:00 - 19:00",null,null,"wybierz kasę z listy",68,null,null,"Katowice","26","Katowice, kasa nr 26","84 1140 1010 4167 0000 0052 2026"]
[null,null,{"$f":"_xlfn.IFNA(VLOOKUP(ROWS($C$5:$C70),D70:E292,2,FALSE),\"\")","v":"Kołobrzeg, kasa nr 32"},{"$f":"IF(ISNUMBER(SEARCH($D$3,E70)),MAX($D$4:$D69)+1,0)","v":66},"Kołobrzeg, kasa nr 32","52 1140 1010 4167 0000 0054 1032","Kołobrzeg","K-32","32","Sekcja ","07:00 - 19:00",null,null,"wybierz kasę z listy",69,null,null,"Katowice","28","Katowice, kasa nr 28","30 1140 1010 4167 0000 0052 2028"]
[null,null,{"$f":"_xlfn.IFNA(VLOOKUP(ROWS($C$5:$C71),D71:E293,2,FALSE),\"\")","v":"Kołobrzeg, kasa nr 33"},{"$f":"IF(ISNUMBER(SEARCH($D$3,E71)),MAX($D$4:$D70)+1,0)","v":67},"Kołobrzeg, kasa nr 33","25 1140 1010 4167 0000 0054 1033","Kołobrzeg","K-33","33","Sekcja ","07:00 - 19:00",null,null,"wybierz kasę z listy",70,null,null,"Katowice","30","Katowice, kasa nr 30","73 1140 1010 4167 0000 0052 2030"]
[null,null,{"$f":"_xlfn.IFNA(VLOOKUP(ROWS($C$5:$C72),D72:E294,2,FALSE),\"\")","v":"Kołobrzeg, kasa nr 34"},{"$f":"IF(ISNUMBER(SEARCH($D$3,E72)),MAX($D$4:$D71)+1,0)","v":68},"Kołobrzeg, kasa nr 34","95 1140 1010 4167 0000 0054 1034","Kołobrzeg","K-34","34","Sekcja ","07:00 - 19:00",null,null,"wybierz kasę z listy",71,null,null,"Kedzierzyn Koźle","31","Kedzierzyn Koźle, kasa nr 31","46 1140 1010 4167 0000 0052 2031"]
[null,null,{"$f":"_xlfn.IFNA(VLOOKUP(ROWS($C$5:$C73),D73:E295,2,FALSE),\"\")","v":"Kołobrzeg, kasa nr 35"},{"$f":"IF(ISNUMBER(SEARCH($D$3,E73)),MAX($D$4:$D72)+1,0)","v":69},"Kołobrzeg, kasa nr 35","68 1140 1010 4167 0000 0054 1035","Kołobrzeg","K-35","35","Sekcja ","07:00 - 19:00",null,null,"wybierz kasę z listy",72,null,null,"Kielce","4","Kielce, kasa nr 04","33 1140 1010 4167 0000 0052 1004"]
[null,null,{"$f":"_xlfn.IFNA(VLOOKUP(ROWS($C$5:$C74),D74:E296,2,FALSE),\"\")","v":"Konin, kasa nr 08"},{"$f":"IF(ISNUMBER(SEARCH($D$3,E74)),MAX($D$4:$D73)+1,0)","v":70},"Konin, kasa nr 08","70 1140 1010 4167 0000 0053 1008","Konin","K-08",8,"Sekcja ","07:00 - 19:00",null,null,"wybierz kasę z listy",73,null,null,"Kielce","36","Kielce, kasa nr 36","42 1140 1010 4167 0000 0052 1036"]
[null,null,{"$f":"_xlfn.IFNA(VLOOKUP(ROWS($C$5:$C75),D75:E297,2,FALSE),\"\")","v":"Koszalin, kasa nr 36"},{"$f":"IF(ISNUMBER(SEARCH($D$3,E75)),MAX($D$4:$D74)+1,0)","v":71},"Koszalin, kasa nr 36","41 1140 1010 4167 0000 0054 1036","Koszalin","K-36","36","Sekcja ","07:00 - 19:00",null,null,"wybierz kasę z listy",74,null,null,"Kielce","64","Kielce, kasa nr 64","62 1140 1010 4167 0000 0052 1064"]
[null,null,{"$f":"_xlfn.IFNA(VLOOKUP(ROWS($C$5:$C76),D76:E298,2,FALSE),\"\")","v":"Koszalin, kasa nr 38"},{"$f":"IF(ISNUMBER(SEARCH($D$3,E76)),MAX($D$4:$D75)+1,0)","v":72},"Koszalin, kasa nr 38","84 1140 1010 4167 0000 0054 1038","Koszalin","K-38","38","Sekcja ","07:00 - 19:00",null,null,"wybierz kasę z listy",75,null,null,"Kołobrzeg - kasa konduktorska","1","Kołobrzeg - kasa konduktorska, kasa nr 01","96 1140 1010 4167 0000 0054 1501"]
[null,null,{"$f":"_xlfn.IFNA(VLOOKUP(ROWS($C$5:$C77),D77:E299,2,FALSE),\"\")","v":"Kościan, kasa nr 23"},{"$f":"IF(ISNUMBER(SEARCH($D$3,E77)),MAX($D$4:$D76)+1,0)","v":73},"Kościan, kasa nr 23","53 1140 1010 4167 0000 0053 1023","Kościan","K-23","23","Sekcja ","07:00 - 19:00",null,null,"wybierz kasę z listy",76,null,null,"Kołobrzeg","32","Kołobrzeg, kasa nr 32","52 1140 1010 4167 0000 0054 1032"]
[null,null,{"$f":"_xlfn.IFNA(VLOOKUP(ROWS($C$5:$C78),D78:E300,2,FALSE),\"\")","v":"Kraków  Płaszów, kasa nr 11"},{"$f":"IF(ISNUMBER(SEARCH($D$3,E78)),MAX($D$4:$D77)+1,0)","v":74},"Kraków  Płaszów, kasa nr 11","38 1140 1010 4167 0000 0052 1011","Kraków  Płaszów","K-11","11","Sekcja Handlowa w Krakowie","07:00 - 19:00",null,null,"wybierz kasę z listy",77,null,null,"Kołobrzeg","33","Kołobrzeg, kasa nr 33","25 1140 1010 4167 0000 0054 1033"]
[null,null,{"$f":"_xlfn.IFNA(VLOOKUP(ROWS($C$5:$C79),D79:E301,2,FALSE),\"\")","v":"Kraków  Płaszów, kasa nr 26"},{"$f":"IF(ISNUMBER(SEARCH($D$3,E79)),MAX($D$4:$D78)+1,0)","v":75},"Kraków  Płaszów, kasa nr 26","21 1140 1010 4167 0000 0052 1026","Kraków  Płaszów","K-26","26","Sekcja Handlowa w Krakowie","07:00 - 19:00",null,null,"wybierz kasę z listy",78,null,null,"Kołobrzeg","34","Kołobrzeg, kasa nr 34","95 1140 1010 4167 0000 0054 1034"]
[null,null,{"$f":"_xlfn.IFNA(VLOOKUP(ROWS($C$5:$C80),D80:E302,2,FALSE),\"\")","v":"Kraków  Płaszów, kasa nr 37"},{"$f":"IF(ISNUMBER(SEARCH($D$3,E80)),MAX($D$4:$D79)+1,0)","v":76},"Kraków  Płaszów, kasa nr 37","15 1140 1010 4167 0000 0052 1037","Kraków  Płaszów","K-37","37","Sekcja Handlowa w Krakowie","07:00 - 19:00",null,null,"wybierz kasę z listy",79,null,null,"Kołobrzeg","35","Kołobrzeg, kasa nr 35","68 1140 1010 4167 0000 0054 1035"]
[null,null,{"$f":"_xlfn.IFNA(VLOOKUP(ROWS($C$5:$C81),D81:E303,2,FALSE),\"\")","v":"Kutno, kasa nr 16"},{"$f":"IF(ISNUMBER(SEARCH($D$3,E81)),MAX($D$4:$D80)+1,0)","v":77},"Kutno, kasa nr 16","10 1140 1010 4167 0000 0051 5016","Kutno","K-16","16","Sekcja ","07:00 - 19:00",null,null,"wybierz kasę z listy",80,null,null,"Konin","08","Konin, kasa nr 08","70 1140 1010 4167 0000 0053 1008"]
[null,null,{"$f":"_xlfn.IFNA(VLOOKUP(ROWS($C$5:$C82),D82:E304,2,FALSE),\"\")","v":"Kutno, kasa nr 66"},{"$f":"IF(ISNUMBER(SEARCH($D$3,E82)),MAX($D$4:$D81)+1,0)","v":78},"Kutno, kasa nr 66","18 1140 1010 4167 0000 0051 5066","Kutno","K-66","66","Sekcja ","07:00 - 19:00",null,null,"wybierz kasę z listy",81,null,null,"Koszalin","36","Koszalin, kasa nr 36","41 1140 1010 4167 0000 0054 1036"]
[null,null,{"$f":"_xlfn.IFNA(VLOOKUP(ROWS($C$5:$C83),D83:E305,2,FALSE),\"\")","v":"Legnica, kasa nr 28"},{"$f":"IF(ISNUMBER(SEARCH($D$3,E83)),MAX($D$4:$D82)+1,0)","v":79},"Legnica, kasa nr 28","78 1140 1010 4167 0000 0053 2028","Legnica","K-28","28","Sekcja ","07:00 - 19:00",null,null,"wybierz kasę z listy",82,null,null,"Koszalin","38","Koszalin, kasa nr 38","84 1140 1010 4167 0000 0054 1038"]
[null,null,{"$f":"_xlfn.IFNA(VLOOKUP(ROWS($C$5:$C84),D84:E306,2,FALSE),\"\")","v":"Leszno, kasa nr 10"},{"$f":"IF(ISNUMBER(SEARCH($D$3,E84)),MAX($D$4:$D83)+1,0)","v":80},"Leszno, kasa nr 10","16 1140 1010 4167 0000 0053 1010","Leszno","K-10","10","Sekcja ","07:00 - 19:00",null,null,"wybierz kasę z listy",83,null,null,"Kościan","23","Kościan, kasa nr 23","53 1140 1010 4167 0000 0053 1023"]
[null,null,{"$f":"_xlfn.IFNA(VLOOKUP(ROWS($C$5:$C85),D85:E307,2,FALSE),\"\")","v":"Leszno, kasa nr 22"},{"$f":"IF(ISNUMBER(SEARCH($D$3,E85)),MAX($D$4:$D84)+1,0)","v":81},"Leszno, kasa nr 22","80 1140 1010 4167 0000 0053 1022","Leszno","K-22","22","Sekcja ","07:00 - 19:00",null,null,"wybierz kasę z listy",84,null,null,"Kraków  Płaszów","11","Kraków  Płaszów, kasa nr 11","38 1140 1010 4167 0000 0052 1011"]
[null,null,{"$f":"_xlfn.IFNA(VLOOKUP(ROWS($C$5:$C86),D86:E308,2,FALSE),\"\")","v":"Lębork , kasa nr 40"},{"$f":"IF(ISNUMBER(SEARCH($D$3,E86)),MAX($D$4:$D85)+1,0)","v":82},"Lębork , kasa nr 40","25 1140 1010 4167 0000 0054 4040","Lębork ","K-40","40","Sekcja ","07:00 - 19:00",null,null,"wybierz kasę z listy",85,null,null,"Kraków  Płaszów","26","Kraków  Płaszów, kasa nr 26","21 1140 1010 4167 0000 0052 1026"]
[null,null,{"$f":"_xlfn.IFNA(VLOOKUP(ROWS($C$5:$C87),D87:E309,2,FALSE),\"\")","v":"Lublin, kasa nr 01"},{"$f":"IF(ISNUMBER(SEARCH($D$3,E87)),MAX($D$4:$D86)+1,0)","v":83},"Lublin, kasa nr 01","95 1140 1010 4167 0000 0051 3001","Lublin","K-01","1","Sekcja ","07:00 - 19:00",null,null,"wybierz kasę z listy",86,null,null,"Kraków  Płaszów","37","Kraków  Płaszów, kasa nr 37","15 1140 1010 4167 0000 0052 1037"]
[null,null,{"$f":"_xlfn.IFNA(VLOOKUP(ROWS($C$5:$C88),D88:E310,2,FALSE),\"\")","v":"Lublin, kasa nr 02"},{"$f":"IF(ISNUMBER(SEARCH($D$3,E88)),MAX($D$4:$D87)+1,0)","v":84},"Lublin, kasa nr 02","68 1140 1010 4167 0000 0051 3002","Lublin","K-02","2","Sekcja ","07:00 - 19:00",null,null,"wybierz kasę z listy",87,null,null,"Kraków Główny - kasa konduktorska","1","Kraków Główny - kasa konduktorska, kasa nr 01","97 1140 1010 4167 0000 0052 1501"]
[null,null,{"$f":"_xlfn.IFNA(VLOOKUP(ROWS($C$5:$C89),D89:E311,2,FALSE),\"\")","v":"Lublin, kasa nr 03"},{"$f":"IF(ISNUMBER(SEARCH($D$3,E89)),MAX($D$4:$D88)+1,0)","v":85},"Lublin, kasa nr 03","41 1140 1010 4167 0000 0051 3003","Lublin","K-03","3","Sekcja ","07:00 - 19:00",null,null,"wybierz kasę z listy",88,null,null,"Kraków Płaszów - kasa konduktorska","7","Kraków Płaszów - kasa konduktorska, kasa nr 07","32 1140 1010 4167 0000 0052 1507"]
[null,null,{"$f":"_xlfn.IFNA(VLOOKUP(ROWS($C$5:$C90),D90:E312,2,FALSE),\"\")","v":"Lublin, kasa nr 65"},{"$f":"IF(ISNUMBER(SEARCH($D$3,E90)),MAX($D$4:$D89)+1,0)","v":86},"Lublin, kasa nr 65","16 1140 1010 4167 0000 0051 3065","Lublin","K-65","65","Sekcja ","07:00 - 19:00",null,null,"wybierz kasę z listy",89,null,null,"Kutno - kasa konduktorska","4","Kutno - kasa konduktorska, kasa nr 04","26 1140 1010 4167 0000 0051 5504"]
[null,null,{"$f":"_xlfn.IFNA(VLOOKUP(ROWS($C$5:$C91),D91:E313,2,FALSE),\"\")","v":"Łeba, kasa nr 05"},{"$f":"IF(ISNUMBER(SEARCH($D$3,E91)),MAX($D$4:$D90)+1,0)","v":87},"Łeba, kasa nr 05","29 1140 1010 4167 0000 0054 6005","Łeba","K-05","5","Sekcja ","07:00 - 19:00",null,null,"wybierz kasę z listy",90,null,null,"Kutno","16","Kutno, kasa nr 16","10 1140 1010 4167 0000 0051 5016"]
[null,null,{"$f":"_xlfn.IFNA(VLOOKUP(ROWS($C$5:$C92),D92:E314,2,FALSE),\"\")","v":"Łowicz, kasa nr 12"},{"$f":"IF(ISNUMBER(SEARCH($D$3,E92)),MAX($D$4:$D91)+1,0)","v":88},"Łowicz, kasa nr 12","21 1140 1010 4167 0000 0051 5012","Łowicz","K-12","12","Sekcja ","07:00 - 19:00",null,null,"wybierz kasę z listy",91,null,null,"Kutno","66","Kutno, kasa nr 66","18 1140 1010 4167 0000 0051 5066"]
[null,null,{"$f":"_xlfn.IFNA(VLOOKUP(ROWS($C$5:$C93),D93:E315,2,FALSE),\"\")","v":"Łódź Chojny, kasa nr 01"},{"$f":"IF(ISNUMBER(SEARCH($D$3,E93)),MAX($D$4:$D92)+1,0)","v":89},"Łódź Chojny, kasa nr 01","27 1140 1010 4167 0000 0051 5001","Łódź Chojny","K-01","1","Sekcja ","07:00 - 19:00",null,null,"wybierz kasę z listy",92,null,null,"Legnica","28","Legnica, kasa nr 28","78 1140 1010 4167 0000 0053 2028"]
[null,null,{"$f":"_xlfn.IFNA(VLOOKUP(ROWS($C$5:$C94),D94:E316,2,FALSE),\"\")","v":"Łódź Fabryczna, kasa nr 04"},{"$f":"IF(ISNUMBER(SEARCH($D$3,E94)),MAX($D$4:$D93)+1,0)","v":90},"Łódź Fabryczna, kasa nr 04","09 1140 1010 4167 0000 0051 6004","Łódź Fabryczna","K-04","4","Sekcja ","07:00 - 19:00",null,null,"wybierz kasę z listy",93,null,null,"Leszno","10","Leszno, kasa nr 10","16 1140 1010 4167 0000 0053 1010"]
[null,null,{"$f":"_xlfn.IFNA(VLOOKUP(ROWS($C$5:$C95),D95:E317,2,FALSE),\"\")","v":"Łódź Fabryczna, kasa nr 06"},{"$f":"IF(ISNUMBER(SEARCH($D$3,E95)),MAX($D$4:$D94)+1,0)","v":91},"Łódź Fabryczna, kasa nr 06","52 1140 1010 4167 0000 0051 6006","Łódź Fabryczna","K-06","6","Sekcja ","07:00 - 19:00",null,null,"wybierz kasę z listy",94,null,null,"Leszno","22","Leszno, kasa nr 22","80 1140 1010 4167 0000 0053 1022"]
[null,null,{"$f":"_xlfn.IFNA(VLOOKUP(ROWS($C$5:$C96),D96:E318,2,FALSE),\"\")","v":"Łódź Fabryczna, kasa nr 07"},{"$f":"IF(ISNUMBER(SEARCH($D$3,E96)),MAX($D$4:$D95)+1,0)","v":92},"Łódź Fabryczna, kasa nr 07","25 1140 1010 4167 0000 0051 6007","Łódź Fabryczna","K-07","7","Sekcja ","07:00 - 19:00",null,null,"wybierz kasę z listy",95,null,null,"Lębork ","40","Lębork , kasa nr 40","25 1140 1010 4167 0000 0054 4040"]
[null,null,{"$f":"_xlfn.IFNA(VLOOKUP(ROWS($C$5:$C97),D97:E319,2,FALSE),\"\")","v":"Łódź Fabryczna, kasa nr 15"},{"$f":"IF(ISNUMBER(SEARCH($D$3,E97)),MAX($D$4:$D96)+1,0)","v":93},"Łódź Fabryczna, kasa nr 15","03 1140 1010 4167 0000 0051 6015","Łódź Fabryczna","K-15","15","Sekcja ","07:00 - 19:00",null,null,"wybierz kasę z listy",96,null,null,"Lublin - kasa konduktorska","9","Lublin - kasa konduktorska, kasa nr 09","56 1140 1010 4167 0000 0051 3509"]
[null,null,{"$f":"_xlfn.IFNA(VLOOKUP(ROWS($C$5:$C98),D98:E320,2,FALSE),\"\")","v":"Łódź Widzew, kasa nr 02"},{"$f":"IF(ISNUMBER(SEARCH($D$3,E98)),MAX($D$4:$D97)+1,0)","v":94},"Łódź Widzew, kasa nr 02","97 1140 1010 4167 0000 0051 5002","Łódź Widzew","K-02","2","Sekcja ","07:00 - 19:00",null,null,"wybierz kasę z listy",97,null,null,"Lublin Główny","4","Lublin Główny, kasa nr 04","39 1140 1010 4167 0000 0001 3004"]
[null,null,{"$f":"_xlfn.IFNA(VLOOKUP(ROWS($C$5:$C99),D99:E321,2,FALSE),\"\")","v":"Łódź Widzew, kasa nr 09"},{"$f":"IF(ISNUMBER(SEARCH($D$3,E99)),MAX($D$4:$D98)+1,0)","v":95},"Łódź Widzew, kasa nr 09","52 1140 1010 4167 0000 0054 5009\n","Łódź Widzew","K-09","9","Sekcja ","07:00 - 19:00",null,null,"wybierz kasę z listy",98,null,null,"Lublin","1","Lublin, kasa nr 01","95 1140 1010 4167 0000 0051 3001"]
[null,null,{"$f":"_xlfn.IFNA(VLOOKUP(ROWS($C$5:$C100),D100:E322,2,FALSE),\"\")","v":"Łódź Widzew, kasa nr 13"},{"$f":"IF(ISNUMBER(SEARCH($D$3,E100)),MAX($D$4:$D99)+1,0)","v":96},"Łódź Widzew, kasa nr 13","91 1140 1010 4167 0000 0051 5013","Łódź Widzew","K-13","13","Sekcja ","07:00 - 19:00",null,null,"wybierz kasę z listy",99,null,null,"Lublin","2","Lublin, kasa nr 02","68 1140 1010 4167 0000 0051 3002"]
[null,null,{"$f":"_xlfn.IFNA(VLOOKUP(ROWS($C$5:$C101),D101:E323,2,FALSE),\"\")","v":"Łódź Widzew, kasa nr 14"},{"$f":"IF(ISNUMBER(SEARCH($D$3,E101)),MAX($D$4:$D100)+1,0)","v":97},"Łódź Widzew, kasa nr 14","64 1140 1010 4167 0000 0051 5014","Łódź Widzew","K-14","14","Sekcja ","07:00 - 19:00",null,null,"wybierz kasę z listy",100,null,null,"Lublin","3","Lublin, kasa nr 03","41 1140 1010 4167 0000 0051 3003"]
[null,null,{"$f":"_xlfn.IFNA(VLOOKUP(ROWS($C$5:$C102),D102:E324,2,FALSE),\"\")","v":"Łódż Kaliska, kasa nr 04"},{"$f":"IF(ISNUMBER(SEARCH($D$3,E102)),MAX($D$4:$D101)+1,0)","v":98},"Łódż Kaliska, kasa nr 04","43 1140 1010 4167 0000 0051 5004","Łódż Kaliska","K-04","4","Sekcja ","07:00 - 19:00",null,null,"wybierz kasę z listy",101,null,null,"Lublin","65","Lublin, kasa nr 65","16 1140 1010 4167 0000 0051 3065"]
[null,null,{"$f":"_xlfn.IFNA(VLOOKUP(ROWS($C$5:$C103),D103:E325,2,FALSE),\"\")","v":"Łódż Kaliska, kasa nr 07"},{"$f":"IF(ISNUMBER(SEARCH($D$3,E103)),MAX($D$4:$D102)+1,0)","v":99},"Łódż Kaliska, kasa nr 07","59 1140 1010 4167 0000 0051 5007","Łódż Kaliska","K-07","7","Sekcja ","07:00 - 19:00",null,null,"wybierz kasę z listy",102,null,null,"Łeba","5","Łeba, kasa nr 05","29 1140 1010 4167 0000 0054 6005"]
[null,null,{"$f":"_xlfn.IFNA(VLOOKUP(ROWS($C$5:$C104),D104:E326,2,FALSE),\"\")","v":"Łódż Kaliska, kasa nr 08"},{"$f":"IF(ISNUMBER(SEARCH($D$3,E104)),MAX($D$4:$D103)+1,0)","v":100},"Łódż Kaliska, kasa nr 08","32 1140 1010 4167 0000 0051 5008","Łódż Kaliska","K-08","8","Sekcja ","07:00 - 19:00",null,null,"wybierz kasę z listy",103,null,null,"Łowicz","12","Łowicz, kasa nr 12","21 1140 1010 4167 0000 0051 5012"]
[null,null,{"$f":"_xlfn.IFNA(VLOOKUP(ROWS($C$5:$C105),D105:E327,2,FALSE),\"\")","v":"Łódż Kaliska, kasa nr 09"},{"$f":"IF(ISNUMBER(SEARCH($D$3,E105)),MAX($D$4:$D104)+1,0)","v":101},"Łódż Kaliska, kasa nr 09","05 1140 1010 4167 0000 0051 5009","Łódż Kaliska","K-09","9","Sekcja ","07:00 - 19:00",null,null,"wybierz kasę z listy",104,null,null,"Łódź Chojny","1","Łódź Chojny, kasa nr 01","27 1140 1010 4167 0000 0051 5001"]
[null,null,{"$f":"_xlfn.IFNA(VLOOKUP(ROWS($C$5:$C106),D106:E328,2,FALSE),\"\")","v":"Malbork, kasa nr 12"},{"$f":"IF(ISNUMBER(SEARCH($D$3,E106)),MAX($D$4:$D105)+1,0)","v":102},"Malbork, kasa nr 12","10 1140 1010 4167 0000 0054 1012","Malbork","K-12","12","Sekcja ","07:00 - 19:00",null,null,"wybierz kasę z listy",105,null,null,"Łódź Fabryczna","4","Łódź Fabryczna, kasa nr 04","09 1140 1010 4167 0000 0051 6004"]
[null,null,{"$f":"_xlfn.IFNA(VLOOKUP(ROWS($C$5:$C107),D107:E329,2,FALSE),\"\")","v":"Malbork, kasa nr 15"},{"$f":"IF(ISNUMBER(SEARCH($D$3,E107)),MAX($D$4:$D106)+1,0)","v":103},"Malbork, kasa nr 15","26 1140 1010 4167 0000 0054 1015","Malbork","K-15","15","Sekcja ","07:00 - 19:00",null,null,"wybierz kasę z listy",106,null,null,"Łódź Fabryczna","6","Łódź Fabryczna, kasa nr 06","52 1140 1010 4167 0000 0051 6006"]
[null,null,{"$f":"_xlfn.IFNA(VLOOKUP(ROWS($C$5:$C108),D108:E330,2,FALSE),\"\")","v":"Nowy Sącz, kasa nr 28"},{"$f":"IF(ISNUMBER(SEARCH($D$3,E108)),MAX($D$4:$D107)+1,0)","v":104},"Nowy Sącz, kasa nr 28","64 1140 1010 4167 0000 0052 1028","Nowy Sącz","K-28","28","Sekcja Handlowa w Krakowie","07:00 - 19:00",null,null,"wybierz kasę z listy",107,null,null,"Łódź Fabryczna","7","Łódź Fabryczna, kasa nr 07","25 1140 1010 4167 0000 0051 6007"]
[null,null,{"$f":"_xlfn.IFNA(VLOOKUP(ROWS($C$5:$C109),D109:E331,2,FALSE),\"\")","v":"Nowy Targ, kasa nr 29"},{"$f":"IF(ISNUMBER(SEARCH($D$3,E109)),MAX($D$4:$D108)+1,0)","v":105},"Nowy Targ, kasa nr 29","37 1140 1010 4167 0000 0052 1029","Nowy Targ","K-29","29","Sekcja Handlowa w Krakowie","07:00 - 19:00",null,null,"wybierz kasę z listy",108,null,null,"Łódź Fabryczna","15","Łódź Fabryczna, kasa nr 15","03 1140 1010 4167 0000 0051 6015"]
[null,null,{"$f":"_xlfn.IFNA(VLOOKUP(ROWS($C$5:$C110),D110:E332,2,FALSE),\"\")","v":"Olsztyn Główny, kasa nr 03"},{"$f":"IF(ISNUMBER(SEARCH($D$3,E110)),MAX($D$4:$D109)+1,0)","v":106},"Olsztyn Główny, kasa nr 03","54 1140 1010 4167 0000 0054 4003","Olsztyn Główny","K-03","3","Sekcja ","07:00 - 19:00",null,null,"wybierz kasę z listy",109,null,null,"Łódź Widzew","2","Łódź Widzew, kasa nr 02","97 1140 1010 4167 0000 0051 5002"]
[null,null,{"$f":"_xlfn.IFNA(VLOOKUP(ROWS($C$5:$C111),D111:E333,2,FALSE),\"\")","v":"Olsztyn Główny, kasa nr 04"},{"$f":"IF(ISNUMBER(SEARCH($D$3,E111)),MAX($D$4:$D110)+1,0)","v":107},"Olsztyn Główny, kasa nr 04","27 1140 1010 4167 0000 0054 4004","Olsztyn Główny","K-04","4","Sekcja ","07:00 - 19:00",null,null,"wybierz kasę z listy",110,null,null,"Łódź Widzew","9","Łódź Widzew, kasa nr 09","52 1140 1010 4167 0000 0054 5009\n"]
[null,null,{"$f":"_xlfn.IFNA(VLOOKUP(ROWS($C$5:$C112),D112:E334,2,FALSE),\"\")","v":"Olsztyn Główny, kasa nr 05"},{"$f":"IF(ISNUMBER(SEARCH($D$3,E112)),MAX($D$4:$D111)+1,0)","v":108},"Olsztyn Główny, kasa nr 05","97 1140 1010 4167 0000 0054 4005","Olsztyn Główny","K-05","5","Sekcja ","07:00 - 19:00",null,null,"wybierz kasę z listy",111,null,null,"Łódź Widzew","13","Łódź Widzew, kasa nr 13","91 1140 1010 4167 0000 0051 5013"]
[null,null,{"$f":"_xlfn.IFNA(VLOOKUP(ROWS($C$5:$C113),D113:E335,2,FALSE),\"\")","v":"Olsztyn Główny, kasa nr 06"},{"$f":"IF(ISNUMBER(SEARCH($D$3,E113)),MAX($D$4:$D112)+1,0)","v":109},"Olsztyn Główny, kasa nr 06","70 1140 1010 4167 0000 0054 4006","Olsztyn Główny","K-06","6","Sekcja ","07:00 - 19:00",null,null,"wybierz kasę z listy",112,null,null,"Łódź Widzew","14","Łódź Widzew, kasa nr 14","64 1140 1010 4167 0000 0051 5014"]
[null,null,{"$f":"_xlfn.IFNA(VLOOKUP(ROWS($C$5:$C114),D114:E336,2,FALSE),\"\")","v":"Olsztyn Główny, kasa nr 07"},{"$f":"IF(ISNUMBER(SEARCH($D$3,E114)),MAX($D$4:$D113)+1,0)","v":110},"Olsztyn Główny, kasa nr 07","43 1140 1010 4167 0000 0054 4007","Olsztyn Główny","K-07","7","Sekcja ","07:00 - 19:00",null,null,"wybierz kasę z listy",113,null,null,"Łódź","3","Łódź, kasa nr 03","53 1140 1010 4167 0000 0051 5503"]
[null,null,{"$f":"_xlfn.IFNA(VLOOKUP(ROWS($C$5:$C115),D115:E337,2,FALSE),\"\")","v":"Olsztyn Zachodni, kasa nr 09"},{"$f":"IF(ISNUMBER(SEARCH($D$3,E115)),MAX($D$4:$D114)+1,0)","v":111},"Olsztyn Zachodni, kasa nr 09","86 1140 1010 4167 0000 0054 4009","Olsztyn Zachodni","K-09","9","Sekcja ","07:00 - 19:00",null,null,"wybierz kasę z listy",114,null,null,"Malbork","12","Malbork, kasa nr 12","10 1140 1010 4167 0000 0054 1012"]
[null,null,{"$f":"_xlfn.IFNA(VLOOKUP(ROWS($C$5:$C116),D116:E338,2,FALSE),\"\")","v":"Opole Gł. , kasa nr 25"},{"$f":"IF(ISNUMBER(SEARCH($D$3,E116)),MAX($D$4:$D115)+1,0)","v":112},"Opole Gł. , kasa nr 25","62 1140 1010 4167 0000 0053 2025","Opole Gł. ","K-25","25","Sekcja ","07:00 - 19:00",null,null,"wybierz kasę z listy",115,null,null,"Malbork","15","Malbork, kasa nr 15","26 1140 1010 4167 0000 0054 1015"]
[null,null,{"$f":"_xlfn.IFNA(VLOOKUP(ROWS($C$5:$C117),D117:E339,2,FALSE),\"\")","v":"Opole Gł. , kasa nr 26"},{"$f":"IF(ISNUMBER(SEARCH($D$3,E117)),MAX($D$4:$D116)+1,0)","v":113},"Opole Gł. , kasa nr 26","35 1140 1010 4167 0000 0053 2026","Opole Gł. ","K-26","26","Sekcja ","07:00 - 19:00",null,null,"wybierz kasę z listy",116,null,null,"Nowy Sącz","28","Nowy Sącz, kasa nr 28","64 1140 1010 4167 0000 0052 1028"]
[null,null,{"$f":"_xlfn.IFNA(VLOOKUP(ROWS($C$5:$C118),D118:E340,2,FALSE),\"\")","v":"Opole Gł. , kasa nr 27"},{"$f":"IF(ISNUMBER(SEARCH($D$3,E118)),MAX($D$4:$D117)+1,0)","v":114},"Opole Gł. , kasa nr 27","08 1140 1010 4167 0000 0053 2027","Opole Gł. ","K-27","27","Sekcja ","07:00 - 19:00",null,null,"wybierz kasę z listy",117,null,null,"Nowy Targ","29","Nowy Targ, kasa nr 29","37 1140 1010 4167 0000 0052 1029"]
[null,null,{"$f":"_xlfn.IFNA(VLOOKUP(ROWS($C$5:$C119),D119:E341,2,FALSE),\"\")","v":"Piła Główna, kasa nr 12"},{"$f":"IF(ISNUMBER(SEARCH($D$3,E119)),MAX($D$4:$D118)+1,0)","v":115},"Piła Główna, kasa nr 12","59 1140 1010 4167 0000 0053 1012","Piła Główna","K-12","12","Sekcja ","07:00 - 19:00",null,null,"wybierz kasę z listy",118,null,null,"Olsztyn Główny - kasa konduktorska","05","Olsztyn Główny - kasa konduktorska, kasa nr 05","80 1140 1010 4167 0000 0054 4505"]
[null,null,{"$f":"_xlfn.IFNA(VLOOKUP(ROWS($C$5:$C120),D120:E342,2,FALSE),\"\")","v":"Piotrków Tryb., kasa nr 05"},{"$f":"IF(ISNUMBER(SEARCH($D$3,E120)),MAX($D$4:$D119)+1,0)","v":116},"Piotrków Tryb., kasa nr 05","16 1140 1010 4167 0000 0051 5005","Piotrków Tryb.","K-05","5","Sekcja ","07:00 - 19:00",null,null,"wybierz kasę z listy",119,null,null,"Olsztyn Główny","3","Olsztyn Główny, kasa nr 03","54 1140 1010 4167 0000 0054 4003"]
[null,null,{"$f":"_xlfn.IFNA(VLOOKUP(ROWS($C$5:$C121),D121:E343,2,FALSE),\"\")","v":"Przemyśl Gł., kasa nr 05"},{"$f":"IF(ISNUMBER(SEARCH($D$3,E121)),MAX($D$4:$D120)+1,0)","v":117},"Przemyśl Gł., kasa nr 05","35 1140 1010 4167 0000 0052 3005","Przemyśl Gł.","K-05",5,"Sekcja Handlowa w Przemyślu","06:00 - 18:00","Malgorzata.Brzezawska@intercity.pl",null,260,120,null,null,"Olsztyn Główny","4","Olsztyn Główny, kasa nr 04","27 1140 1010 4167 0000 0054 4004"]
[null,null,{"$f":"_xlfn.IFNA(VLOOKUP(ROWS($C$5:$C122),D122:E344,2,FALSE),\"\")","v":"Przemyśl Gł., kasa nr 06"},{"$f":"IF(ISNUMBER(SEARCH($D$3,E122)),MAX($D$4:$D121)+1,0)","v":118},"Przemyśl Gł., kasa nr 06","08 1140 1010 4167 0000 0052 3006","Przemyśl Gł.","K-06",6,"Sekcja Handlowa w Przemyślu","06:00 - 18:00","Malgorzata.Brzezawska@intercity.pl",null,138,121,null,null,"Olsztyn Główny","5","Olsztyn Główny, kasa nr 05","97 1140 1010 4167 0000 0054 4005"]
[null,null,{"$f":"_xlfn.IFNA(VLOOKUP(ROWS($C$5:$C123),D123:E345,2,FALSE),\"\")","v":"Przemyśl Gł., kasa nr 11"},{"$f":"IF(ISNUMBER(SEARCH($D$3,E123)),MAX($D$4:$D122)+1,0)","v":119},"Przemyśl Gł., kasa nr 11","67 1140 1010 4167 0000 0052 3011","Przemyśl Gł.","K-11","11","Sekcja Handlowa w Przemyślu","07:00 - 19:00","Malgorzata.Brzezawska@intercity.pl",null,139,122,null,null,"Olsztyn Główny","6","Olsztyn Główny, kasa nr 06","70 1140 1010 4167 0000 0054 4006"]
[null,null,{"$f":"_xlfn.IFNA(VLOOKUP(ROWS($C$5:$C124),D124:E346,2,FALSE),\"\")","v":"Przeworsk, kasa nr 13"},{"$f":"IF(ISNUMBER(SEARCH($D$3,E124)),MAX($D$4:$D123)+1,0)","v":120},"Przeworsk, kasa nr 13","13 1140 1010 4167 0000 0052 3013","Przeworsk","K-13","13",null,"07:00 - 19:00",null,null,"wybierz kasę z listy",123,null,null,"Olsztyn Główny","7","Olsztyn Główny, kasa nr 07","43 1140 1010 4167 0000 0054 4007"]
[null,null,{"$f":"_xlfn.IFNA(VLOOKUP(ROWS($C$5:$C125),D125:E347,2,FALSE),\"\")","v":"Puławy, kasa nr 05"},0,"Pszczyna , kasa nr 49","64 1140 1010 4167 0000 0004 5049","Pszczyna ","K-49","49","Sekcja Handlowa w Katowicach","07:00 - 19:00","olga.glab@intercity.pl;anna.jablonska@intercity.pl;zdzislawa.rosochacka@intercity.pl;",null,"wybierz kasę z listy",124,null,null,"Olsztyn Zachodni","9","Olsztyn Zachodni, kasa nr 09","86 1140 1010 4167 0000 0054 4009"]
[null,null,{"$f":"_xlfn.IFNA(VLOOKUP(ROWS($C$5:$C126),D126:E348,2,FALSE),\"\")","v":"Radom, kasa nr 34"},{"$f":"IF(ISNUMBER(SEARCH($D$3,E126)),MAX($D$4:$D125)+1,0)","v":121},"Puławy, kasa nr 05","63 1140 1010 4167 0000 0054 5005","Puławy","K-05",5,"Sekcja ","07:00 - 19:00",null,null,"wybierz kasę z listy",125,null,null,"Opole Gł. ","25","Opole Gł. , kasa nr 25","62 1140 1010 4167 0000 0053 2025"]
[null,null,{"$f":"_xlfn.IFNA(VLOOKUP(ROWS($C$5:$C127),D127:E349,2,FALSE),\"\")","v":"Radom, kasa nr 67"},{"$f":"IF(ISNUMBER(SEARCH($D$3,E127)),MAX($D$4:$D126)+1,0)","v":122},"Radom, kasa nr 34","48 1140 1010 4167 0000 0051 1034","Radom","K-34","34","Sekcja ","07:00 - 19:00",null,null,"wybierz kasę z listy",126,null,null,"Opole Gł. ","26","Opole Gł. , kasa nr 26","35 1140 1010 4167 0000 0053 2026"]
[null,null,{"$f":"_xlfn.IFNA(VLOOKUP(ROWS($C$5:$C128),D128:E350,2,FALSE),\"\")","v":"Rybnik, kasa nr 50"},{"$f":"IF(ISNUMBER(SEARCH($D$3,E128)),MAX($D$4:$D127)+1,0)","v":123},"Radom, kasa nr 67","30 1140 1010 4167 0000 0051 1067","Radom","K-67","67","Sekcja ","07:00 - 19:00",null,null,"wybierz kasę z listy",127,null,null,"Opole Gł. ","27","Opole Gł. , kasa nr 27","08 1140 1010 4167 0000 0053 2027"]
[null,null,{"$f":"_xlfn.IFNA(VLOOKUP(ROWS($C$5:$C129),D129:E351,2,FALSE),\"\")","v":"Rzepin, kasa nr 18"},{"$f":"IF(ISNUMBER(SEARCH($D$3,E129)),MAX($D$4:$D128)+1,0)","v":124},"Rybnik, kasa nr 50","18 1140 1010 4167 0000 0052 2050","Rybnik","K-50","50","Sekcja Handlowa w Katowicach","07:15 - 19:15","olga.glab@intercity.pl;anna.jablonska@intercity.pl;zdzislawa.rosochacka@intercity.pl;",null,147,128,null,null,"Piła Główna","12","Piła Główna, kasa nr 12","59 1140 1010 4167 0000 0053 1012"]
[null,null,{"$f":"_xlfn.IFNA(VLOOKUP(ROWS($C$5:$C130),D130:E352,2,FALSE),\"\")","v":"Rzeszów, kasa nr 03"},{"$f":"IF(ISNUMBER(SEARCH($D$3,E130)),MAX($D$4:$D129)+1,0)","v":125},"Rzepin, kasa nr 18","91 1140 1010 4167 0000 0053 1018","Rzepin","K-18","18","Sekcja ","07:00 - 19:00",null,null,"wybierz kasę z listy",129,null,null,"Piotrków Tryb.","5","Piotrków Tryb., kasa nr 05","16 1140 1010 4167 0000 0051 5005"]
[null,null,{"$f":"_xlfn.IFNA(VLOOKUP(ROWS($C$5:$C131),D131:E353,2,FALSE),\"\")","v":"Rzeszów, kasa nr 04"},{"$f":"IF(ISNUMBER(SEARCH($D$3,E131)),MAX($D$4:$D130)+1,0)","v":126},"Rzeszów, kasa nr 03","89 1140 1010 4167 0000 0052 3003","Rzeszów","K-03",3,null,"07:00 - 19:00",null,null,"wybierz kasę z listy",130,null,null,"Przemyśl - kasa konduktorska","6","Przemyśl - kasa konduktorska, kasa nr 06","88 1140 1010 4167 0000 0052 3506"]
[null,null,{"$f":"_xlfn.IFNA(VLOOKUP(ROWS($C$5:$C132),D132:E354,2,FALSE),\"\")","v":"Rzeszów, kasa nr 09"},{"$f":"IF(ISNUMBER(SEARCH($D$3,E132)),MAX($D$4:$D131)+1,0)","v":127},"Rzeszów, kasa nr 04","62 1140 1010 4167 0000 0052 3004","Rzeszów",{"$f":"IF(VALUE(I132)<10,\"K-\"&\"0\"&I132,\"K-\"&I132)","v":"K-04"},4,null,"07:00 - 19:00",null,null,"wybierz kasę z listy",131,null,null,"Przemyśl","05","Przemyśl, kasa nr 05","35 1140 1010 4167 0000 0052 3005"]
[null,null,{"$f":"_xlfn.IFNA(VLOOKUP(ROWS($C$5:$C133),D133:E355,2,FALSE),\"\")","v":"Rzeszów, kasa nr 10"},{"$f":"IF(ISNUMBER(SEARCH($D$3,E133)),MAX($D$4:$D132)+1,0)","v":128},"Rzeszów, kasa nr 09","24 1140 1010 4167 0000 0052 3009","Rzeszów","K-09",9,"Sekcja Handlowa w Przemyślu","06:00 - 14:00","Malgorzata.Brzezawska@intercity.pl",null,145,132,null,null,"Przemyśl","06","Przemyśl, kasa nr 06","08 1140 1010 4167 0000 0052 3006"]
[null,null,{"$f":"_xlfn.IFNA(VLOOKUP(ROWS($C$5:$C134),D134:E356,2,FALSE),\"\")","v":"Skarżysko Kamienna, kasa nr 15"},{"$f":"IF(ISNUMBER(SEARCH($D$3,E134)),MAX($D$4:$D133)+1,0)","v":129},"Rzeszów, kasa nr 10","94 1140 1010 4167 0000 0052 3010","Rzeszów","K-10","10","Sekcja Handlowa w Przemyślu","07:00 - 19:00","Malgorzata.Brzezawska@intercity.pl",null,146,133,null,null,"Przemyśl","11","Przemyśl, kasa nr 11","67 1140 1010 4167 0000 0052 3011"]
[null,null,{"$f":"_xlfn.IFNA(VLOOKUP(ROWS($C$5:$C135),D135:E357,2,FALSE),\"\")","v":"Skarżysko Kamienna, kasa nr 16"},{"$f":"IF(ISNUMBER(SEARCH($D$3,E135)),MAX($D$4:$D134)+1,0)","v":130},"Skarżysko Kamienna, kasa nr 15","27 1140 1010 4167 0000 0052 1015","Skarżysko Kamienna","K-15","15","Sekcja Handlowa w Krakowie","06:00 - 18:00",null,null,152,134,null,null,"Przeworsk","13","Przeworsk, kasa nr 13","13 1140 1010 4167 0000 0052 3013"]
[null,null,{"$f":"_xlfn.IFNA(VLOOKUP(ROWS($C$5:$C136),D136:E358,2,FALSE),\"\")","v":"Skierniewice, kasa nr 03"},{"$f":"IF(ISNUMBER(SEARCH($D$3,E136)),MAX($D$4:$D135)+1,0)","v":131},"Skarżysko Kamienna, kasa nr 16","82 1140 1010 4167 0000 0004 5016","Skarżysko Kamienna","K-16","16","Sekcja Handlowa w Krakowie","08:15 - 20:15",null,null,151,135,null,null,"Pszczyna ","49","Pszczyna , kasa nr 49","64 1140 1010 4167 0000 0004 5049"]
[null,null,{"$f":"_xlfn.IFNA(VLOOKUP(ROWS($C$5:$C137),D137:E359,2,FALSE),\"\")","v":"Skierniewice, kasa nr 10"},{"$f":"IF(ISNUMBER(SEARCH($D$3,E137)),MAX($D$4:$D136)+1,0)","v":132},"Skierniewice, kasa nr 03","70 1140 1010 4167 0000 0051 5003","Skierniewice","K-03","3","Sekcja ","07:00 - 19:00",null,null,"wybierz kasę z listy",136,null,null,"Puławy","05","Puławy, kasa nr 05","63 1140 1010 4167 0000 0054 5005"]
[null,null,{"$f":"_xlfn.IFNA(VLOOKUP(ROWS($C$5:$C138),D138:E360,2,FALSE),\"\")","v":"Skierniewice, kasa nr 11"},{"$f":"IF(ISNUMBER(SEARCH($D$3,E138)),MAX($D$4:$D137)+1,0)","v":133},"Skierniewice, kasa nr 10","75 1140 1010 4167 0000 0051 5010","Skierniewice","K-10","10","Sekcja ","07:00 - 19:00",null,null,"wybierz kasę z listy",137,null,null,"Radom","34","Radom, kasa nr 34","48 1140 1010 4167 0000 0051 1034"]
[null,null,{"$f":"_xlfn.IFNA(VLOOKUP(ROWS($C$5:$C139),D139:E361,2,FALSE),\"\")","v":"Sławno, kasa nr 39"},{"$f":"IF(ISNUMBER(SEARCH($D$3,E139)),MAX($D$4:$D138)+1,0)","v":134},"Skierniewice, kasa nr 11","48 1140 1010 4167 0000 0051 5011","Skierniewice","K-11","11","Sekcja ","07:00 - 19:00",null,null,"wybierz kasę z listy",138,null,null,"Radom","67","Radom, kasa nr 67","30 1140 1010 4167 0000 0051 1067"]
[null,null,{"$f":"_xlfn.IFNA(VLOOKUP(ROWS($C$5:$C140),D140:E362,2,FALSE),\"\")","v":"Słupsk, kasa nr 14"},{"$f":"IF(ISNUMBER(SEARCH($D$3,E140)),MAX($D$4:$D139)+1,0)","v":135},"Sławno, kasa nr 39","57 1140 1010 4167 0000 0054 1039","Sławno","K-39","39","Sekcja ","07:00 - 19:00",null,null,"wybierz kasę z listy",139,null,null,"Rybnik","50","Rybnik, kasa nr 50","18 1140 1010 4167 0000 0052 2050"]
[null,null,{"$f":"_xlfn.IFNA(VLOOKUP(ROWS($C$5:$C141),D141:E363,2,FALSE),\"\")","v":"Słupsk, kasa nr 23"},{"$f":"IF(ISNUMBER(SEARCH($D$3,E141)),MAX($D$4:$D140)+1,0)","v":136},"Słupsk, kasa nr 14","53 1140 1010 4167 0000 0054 1014","Słupsk","K-14","14","Sekcja ","07:00 - 19:00",null,null,"wybierz kasę z listy",140,null,null,"Rzepin","18","Rzepin, kasa nr 18","91 1140 1010 4167 0000 0053 1018"]
[null,null,{"$f":"_xlfn.IFNA(VLOOKUP(ROWS($C$5:$C142),D142:E364,2,FALSE),\"\")","v":"Sopot, kasa nr 27"},{"$f":"IF(ISNUMBER(SEARCH($D$3,E142)),MAX($D$4:$D141)+1,0)","v":137},"Słupsk, kasa nr 23","04 1140 1010 4167 0000 0054 1023","Słupsk","K-23","23","Sekcja ","07:00 - 19:00",null,null,"wybierz kasę z listy",141,null,null,"Rzeszów - kasa konduktorska","05","Rzeszów - kasa konduktorska, kasa nr 05","18 1140 1010 4167 0000 0052 3505"]
[null,null,{"$f":"_xlfn.IFNA(VLOOKUP(ROWS($C$5:$C143),D143:E365,2,FALSE),\"\")","v":"Sopot, kasa nr 28"},{"$f":"IF(ISNUMBER(SEARCH($D$3,E143)),MAX($D$4:$D142)+1,0)","v":138},"Sopot, kasa nr 27","90 1140 1010 4167 0000 0054 1027","Sopot","K-27","27","Sekcja","07:00 - 19:00",null,null,"wybierz kasę z listy",142,null,null,"Rzeszów","03","Rzeszów, kasa nr 03","89 1140 1010 4167 0000 0052 3003"]
[null,null,{"$f":"_xlfn.IFNA(VLOOKUP(ROWS($C$5:$C144),D144:E366,2,FALSE),\"\")","v":"Sosnowiec, kasa nr 08"},{"$f":"IF(ISNUMBER(SEARCH($D$3,E144)),MAX($D$4:$D143)+1,0)","v":139},"Sopot, kasa nr 28","63 1140 1010 4167 0000 0054 1028","Sopot","K-28","28","Sekcja","07:00 - 19:00",null,null,"wybierz kasę z listy",143,null,null,"Rzeszów","04","Rzeszów, kasa nr 04","62 1140 1010 4167 0000 0052 3004"]
[null,null,{"$f":"_xlfn.IFNA(VLOOKUP(ROWS($C$5:$C145),D145:E367,2,FALSE),\"\")","v":"Sosnowiec, kasa nr 09"},{"$f":"IF(ISNUMBER(SEARCH($D$3,E145)),MAX($D$4:$D144)+1,0)","v":140},"Sosnowiec, kasa nr 08","85 1140 1010 4167 0000 0052 2008","Sosnowiec","K-08","8","Sekcja Handlowa w Katowicach","07:00 - 19:00","olga.glab@intercity.pl;anna.jablonska@intercity.pl;zdzislawa.rosochacka@intercity.pl;",null,161,144,null,null,"Rzeszów","09","Rzeszów, kasa nr 09","24 1140 1010 4167 0000 0052 3009"]
[null,null,{"$f":"_xlfn.IFNA(VLOOKUP(ROWS($C$5:$C146),D146:E368,2,FALSE),\"\")","v":"Sosnowiec, kasa nr 47"},{"$f":"IF(ISNUMBER(SEARCH($D$3,E146)),MAX($D$4:$D145)+1,0)","v":141},"Sosnowiec, kasa nr 09","58 1140 1010 4167 0000 0052 2009","Sosnowiec","K-09","9","Sekcja Handlowa w Katowicach","05:30 - 13:30","olga.glab@intercity.pl;anna.jablonska@intercity.pl;zdzislawa.rosochacka@intercity.pl;",null,160,145,null,null,"Rzeszów","10","Rzeszów, kasa nr 10","94 1140 1010 4167 0000 0052 3010"]
[null,null,{"$f":"_xlfn.IFNA(VLOOKUP(ROWS($C$5:$C147),D147:E369,2,FALSE),\"\")","v":"Stargard Szczeciński, kasa nr 05"},{"$f":"IF(ISNUMBER(SEARCH($D$3,E147)),MAX($D$4:$D146)+1,0)","v":142},"Sosnowiec, kasa nr 47","02 1140 1010 4167 0000 0052 2047","Sosnowiec","K-47","47","Sekcja Handlowa w Katowicach","07:30 - 19:30","olga.glab@intercity.pl;anna.jablonska@intercity.pl;zdzislawa.rosochacka@intercity.pl;",null,162,146,null,null,"Skarżysko Kamienna - kasa konduktorska","3","Skarżysko Kamienna - kasa konduktorska, kasa nr 03","43 1140 1010 4167 0000 0052 1503"]
[null,null,{"$f":"_xlfn.IFNA(VLOOKUP(ROWS($C$5:$C148),D148:E370,2,FALSE),\"\")","v":"Szczecin Dąbie, kasa nr 13"},{"$f":"IF(ISNUMBER(SEARCH($D$3,E148)),MAX($D$4:$D147)+1,0)","v":143},"Stargard Szczeciński, kasa nr 05","68 1140 1010 4167 0000 0054 2005","Stargard Szczeciński","K-05","5","Sekcja ","07:00 - 19:00",null,null,"wybierz kasę z listy",147,null,null,"Skarżysko Kamienna","15","Skarżysko Kamienna, kasa nr 15","27 1140 1010 4167 0000 0052 1015"]
[null,null,{"$f":"_xlfn.IFNA(VLOOKUP(ROWS($C$5:$C149),D149:E371,2,FALSE),\"\")","v":"Szczecin Dąbie, kasa nr 28"},{"$f":"IF(ISNUMBER(SEARCH($D$3,E149)),MAX($D$4:$D148)+1,0)","v":144},"Szczecin Dąbie, kasa nr 13","46 1140 1010 4167 0000 0054 2013","Szczecin Dąbie","K-13","13","Sekcja ","07:00 - 19:00",null,null,"wybierz kasę z listy",148,null,null,"Skarżysko Kamienna","16","Skarżysko Kamienna, kasa nr 16","82 1140 1010 4167 0000 0004 5016"]
[null,null,{"$f":"_xlfn.IFNA(VLOOKUP(ROWS($C$5:$C150),D150:E372,2,FALSE),\"\")","v":"Szczecin Główny, kasa nr 01"},{"$f":"IF(ISNUMBER(SEARCH($D$3,E150)),MAX($D$4:$D149)+1,0)","v":145},"Szczecin Dąbie, kasa nr 28","29 1140 1010 4167 0000 0054 2028","Szczecin Dąbie","K-28","28","Sekcja ","07:00 - 19:00",null,null,"wybierz kasę z listy",149,null,null,"Skierniewice","3","Skierniewice, kasa nr 03","70 1140 1010 4167 0000 0051 5003"]
[null,null,{"$f":"_xlfn.IFNA(VLOOKUP(ROWS($C$5:$C151),D151:E376,2,FALSE),\"\")","v":"Szczecin Główny, kasa nr 02"},{"$f":"IF(ISNUMBER(SEARCH($D$3,E151)),MAX($D$4:$D150)+1,0)","v":146},"Szczecin Główny, kasa nr 01","79 1140 1010 4167 0000 0054 2001","Szczecin Główny","K-01","1","Sekcja ","07:00 - 19:00",null,null,"wybierz kasę z listy",153,null,null,"Słupsk - kasa konduktorska","2","Słupsk - kasa konduktorska, kasa nr 02","69 1140 1010 4167 0000 0054 1502"]
[null,null,{"$f":"_xlfn.IFNA(VLOOKUP(ROWS($C$5:$C152),D152:E377,2,FALSE),\"\")","v":"Szczecin Główny, kasa nr 03"},{"$f":"IF(ISNUMBER(SEARCH($D$3,E152)),MAX($D$4:$D151)+1,0)","v":147},"Szczecin Główny, kasa nr 02","52 1140 1010 4167 0000 0054 2002","Szczecin Główny","K-02","2","Sekcja ","07:00 - 19:00",null,null,"wybierz kasę z listy",154,null,null,"Słupsk","14","Słupsk, kasa nr 14","53 1140 1010 4167 0000 0054 1014"]
[null,null,{"$f":"_xlfn.IFNA(VLOOKUP(ROWS($C$5:$C153),D153:E378,2,FALSE),\"\")","v":"Szczecin Główny, kasa nr 04"},{"$f":"IF(ISNUMBER(SEARCH($D$3,E153)),MAX($D$4:$D152)+1,0)","v":148},"Szczecin Główny, kasa nr 03","25 1140 1010 4167 0000 0054 2003","Szczecin Główny","K-03","3","Sekcja ","07:00 - 19:00",null,null,"wybierz kasę z listy",155,null,null,"Słupsk","23","Słupsk, kasa nr 23","04 1140 1010 4167 0000 0054 1023"]
[null,null,{"$f":"_xlfn.IFNA(VLOOKUP(ROWS($C$5:$C154),D154:E379,2,FALSE),\"\")","v":"Szczecin Główny, kasa nr 17"},{"$f":"IF(ISNUMBER(SEARCH($D$3,E154)),MAX($D$4:$D153)+1,0)","v":149},"Szczecin Główny, kasa nr 04","95 1140 1010 4167 0000 0054 2004","Szczecin Główny","K-04","4","Sekcja ","07:00 - 19:00",null,null,"wybierz kasę z listy",156,null,null,"Sopot","27","Sopot, kasa nr 27","90 1140 1010 4167 0000 0054 1027"]
[null,null,{"$f":"_xlfn.IFNA(VLOOKUP(ROWS($C$5:$C155),D155:E380,2,FALSE),\"\")","v":"Szczecin Główny, kasa nr 18"},{"$f":"IF(ISNUMBER(SEARCH($D$3,E155)),MAX($D$4:$D154)+1,0)","v":150},"Szczecin Główny, kasa nr 17","35 1140 1010 4167 0000 0054 2017","Szczecin Główny","K-17","17","Sekcja ","07:00 - 19:00",null,null,"wybierz kasę z listy",157,null,null,"Sopot","28","Sopot, kasa nr 28","63 1140 1010 4167 0000 0054 1028"]
[null,null,{"$f":"_xlfn.IFNA(VLOOKUP(ROWS($C$5:$C156),D156:E381,2,FALSE),\"\")","v":"Świebodzin, kasa nr 14"},{"$f":"IF(ISNUMBER(SEARCH($D$3,E156)),MAX($D$4:$D155)+1,0)","v":151},"Szczecin Główny, kasa nr 18","08 1140 1010 4167 0000 0054 2018","Szczecin Główny","K-18","18","Sekcja ","07:00 - 19:00",null,null,"wybierz kasę z listy",158,null,null,"Sosnowiec","8","Sosnowiec, kasa nr 08","85 1140 1010 4167 0000 0052 2008"]
[null,null,{"$f":"_xlfn.IFNA(VLOOKUP(ROWS($C$5:$C157),D157:E382,2,FALSE),\"\")","v":"Świnoujście, kasa nr 07"},{"$f":"IF(ISNUMBER(SEARCH($D$3,E157)),MAX($D$4:$D156)+1,0)","v":152},"Świebodzin, kasa nr 14","05 1140 1010 4167 0000 0053 1014","Świebodzin","K-14","14","Sekcja ","07:00 - 19:00",null,null,"wybierz kasę z listy",159,null,null,"Sosnowiec","9","Sosnowiec, kasa nr 09","58 1140 1010 4167 0000 0052 2009"]
[null,null,{"$f":"_xlfn.IFNA(VLOOKUP(ROWS($C$5:$C158),D158:E383,2,FALSE),\"\")","v":"Tarnów, kasa nr 02"},{"$f":"IF(ISNUMBER(SEARCH($D$3,E158)),MAX($D$4:$D157)+1,0)","v":153},"Świnoujście, kasa nr 07","14 1140 1010 4167 0000 0054 2007","Świnoujście","K-07","7","Sekcja ","07:00 - 19:00",null,null,"wybierz kasę z listy",160,null,null,"Sosnowiec","46","Sosnowiec, kasa nr 46","29 1140 1010 4167 0000 0052 2046"]
[null,null,{"$f":"_xlfn.IFNA(VLOOKUP(ROWS($C$5:$C159),D159:E384,2,FALSE),\"\")","v":"Tarnów, kasa nr 22"},{"$f":"IF(ISNUMBER(SEARCH($D$3,E159)),MAX($D$4:$D158)+1,0)","v":154},"Tarnów, kasa nr 02","87 1140 1010 4167 0000 0052 1002","Tarnów","K-02","2","Sekcja Handlowa w Krakowie","07:00 - 19:00",null,null,"wybierz kasę z listy",161,null,null,"Sosnowiec","47","Sosnowiec, kasa nr 47","02 1140 1010 4167 0000 0052 2047"]
[null,null,{"$f":"_xlfn.IFNA(VLOOKUP(ROWS($C$5:$C160),D160:E385,2,FALSE),\"\")","v":"Tczew, kasa nr 03"},{"$f":"IF(ISNUMBER(SEARCH($D$3,E160)),MAX($D$4:$D159)+1,0)","v":155},"Tarnów, kasa nr 22","32 1140 1010 4167 0000 0052 1022","Tarnów","K-22","22","Sekcja Handlowa w Krakowie","07:00 - 19:00",null,null,"wybierz kasę z listy",162,null,"Sosnowiec, kasa nr 46","Stargard Szczeciński","5","Stargard Szczeciński, kasa nr 05","68 1140 1010 4167 0000 0054 2005"]
[null,null,{"$f":"_xlfn.IFNA(VLOOKUP(ROWS($C$5:$C161),D161:E386,2,FALSE),\"\")","v":"Tczew, kasa nr 11"},{"$f":"IF(ISNUMBER(SEARCH($D$3,E161)),MAX($D$4:$D160)+1,0)","v":156},"Tczew, kasa nr 03","59 1140 1010 4167 0000 0054 1003","Tczew","K-03","3","Sekcja ","07:00 - 19:00",null,null,"wybierz kasę z listy",163,null,null,"Szczecin Dąbie","13","Szczecin Dąbie, kasa nr 13","46 1140 1010 4167 0000 0054 2013"]
[null,null,{"$f":"_xlfn.IFNA(VLOOKUP(ROWS($C$5:$C162),D162:E387,2,FALSE),\"\")","v":"Teraspol , kasa nr 06"},{"$f":"IF(ISNUMBER(SEARCH($D$3,E162)),MAX($D$4:$D161)+1,0)","v":157},"Tczew, kasa nr 11","37 1140 1010 4167 0000 0054 1011","Tczew","K-11","11","Sekcja ","07:00 - 19:00",null,null,"wybierz kasę z listy",164,null,null,"Szczecin Dąbie","28","Szczecin Dąbie, kasa nr 28","29 1140 1010 4167 0000 0054 2028"]
[null,null,{"$f":"_xlfn.IFNA(VLOOKUP(ROWS($C$5:$C163),D163:E388,2,FALSE),\"\")","v":"Terespol, kasa nr 05"},{"$f":"IF(ISNUMBER(SEARCH($D$3,E163)),MAX($D$4:$D162)+1,0)","v":158},"Teraspol , kasa nr 06","18 1140 1010 4167 0000 0051 7006","Teraspol ","K-06","6","Sekcja ","07:00 - 19:00",null,null,"wybierz kasę z listy",165,null,null,"Szczecin Główny - Centrum Obsługi Klienta","COK 14","Szczecin Główny - Centrum Obsługi Klienta, kasa nr COK 14","19 1140 1010 4167 0000 0054 2014"]
[null,null,{"$f":"_xlfn.IFNA(VLOOKUP(ROWS($C$5:$C164),D164:E389,2,FALSE),\"\")","v":"Toruń Gł, kasa nr 13"},{"$f":"IF(ISNUMBER(SEARCH($D$3,E164)),MAX($D$4:$D163)+1,0)","v":159},"Terespol, kasa nr 05","79 1140 1010 4167 0000 0051 6005","Terespol","K-05","5","Sekcja ","07:00 - 19:00",null,null,"wybierz kasę z listy",166,null,null,"Szczecin Główny - Centrum Obsługi Klienta","COK 15","Szczecin Główny - Centrum Obsługi Klienta, kasa nr COK 15","89 1140 1010 4167 0000 0054 2015"]
[null,null,{"$f":"_xlfn.IFNA(VLOOKUP(ROWS($C$5:$C165),D165:E390,2,FALSE),\"\")","v":"Toruń Gł, kasa nr 14"},{"$f":"IF(ISNUMBER(SEARCH($D$3,E165)),MAX($D$4:$D164)+1,0)","v":160},"Toruń Gł, kasa nr 13","12 1140 1010 4167 0000 0054 3013","Toruń Gł","K-13","13","Sekcja ","07:00 - 19:00",null,null,"wybierz kasę z listy",167,null,null,"Szczecin Główny - Centrum Obsługi Klienta","COK 16","Szczecin Główny - Centrum Obsługi Klienta, kasa nr COK 16","62 1140 1010 4167 0000 0054 2016"]
[null,null,{"$f":"_xlfn.IFNA(VLOOKUP(ROWS($C$5:$C166),D166:E391,2,FALSE),\"\")","v":"Toruń Gł, kasa nr 15"},{"$f":"IF(ISNUMBER(SEARCH($D$3,E166)),MAX($D$4:$D165)+1,0)","v":161},"Toruń Gł, kasa nr 14","82 1140 1010 4167 0000 0054 3014","Toruń Gł","K-14","14","Sekcja ","07:00 - 19:00",null,null,"wybierz kasę z listy",168,null,null,"Szczecin Główny - kasa konduktorska","14","Szczecin Główny - kasa konduktorska, kasa nr 14","02 1140 1010 4167 0000 0054 2514"]
[null,null,{"$f":"_xlfn.IFNA(VLOOKUP(ROWS($C$5:$C167),D167:E392,2,FALSE),\"\")","v":"Tychy, kasa nr 51"},{"$f":"IF(ISNUMBER(SEARCH($D$3,E167)),MAX($D$4:$D166)+1,0)","v":162},"Toruń Gł, kasa nr 15","55 1140 1010 4167 0000 0054 3015","Toruń Gł","K-15","15","Sekcja ","07:00 - 19:00",null,null,"wybierz kasę z listy",169,null,null,"Szczecin Główny","1","Szczecin Główny, kasa nr 01","79 1140 1010 4167 0000 0054 2001"]
[null,null,{"$f":"_xlfn.IFNA(VLOOKUP(ROWS($C$5:$C168),D168:E393,2,FALSE),\"\")","v":"Ustka, kasa nr 26"},{"$f":"IF(ISNUMBER(SEARCH($D$3,E168)),MAX($D$4:$D167)+1,0)","v":163},"Tychy, kasa nr 51","88 1140 1010 4167 0000 0052 2051","Tychy","K-51","51","Sekcja Handlowa w Katowicach","07:50 - 19:50","olga.glab@intercity.pl;anna.jablonska@intercity.pl;zdzislawa.rosochacka@intercity.pl;",null,180,170,null,null,"Szczecin Główny","2","Szczecin Główny, kasa nr 02","52 1140 1010 4167 0000 0054 2002"]
[null,null,{"$f":"_xlfn.IFNA(VLOOKUP(ROWS($C$5:$C169),D169:E394,2,FALSE),\"\")","v":"Warszawa Senacka, kasa nr 36"},{"$f":"IF(ISNUMBER(SEARCH($D$3,E169)),MAX($D$4:$D168)+1,0)","v":164},"Ustka, kasa nr 26","44 1140 1010 4167 0000 0054 6026","Ustka","K-26","26","Sekcja ","07:00 - 19:00",null,null,"wybierz kasę z listy",171,null,null,"Szczecin Główny","3","Szczecin Główny, kasa nr 03","25 1140 1010 4167 0000 0054 2003"]
[null,null,{"$f":"_xlfn.IFNA(VLOOKUP(ROWS($C$5:$C170),D170:E395,2,FALSE),\"\")","v":"Warszawa Zachodnia , kasa nr 33"},{"$f":"IF(ISNUMBER(SEARCH($D$3,E170)),MAX($D$4:$D169)+1,0)","v":165},"Warszawa Senacka, kasa nr 36","91 1140 1010 4167 0000 0051 1036","Warszawa Senacka","K-36","36","Sekcja ","07:00 - 19:00",null,null,"wybierz kasę z listy",172,null,null,"Szczecin Główny","4","Szczecin Główny, kasa nr 04","95 1140 1010 4167 0000 0054 2004"]
[null,null,{"$f":"_xlfn.IFNA(VLOOKUP(ROWS($C$5:$C171),D171:E396,2,FALSE),\"\")","v":"Warszawa Zachodnia, kasa nr 24"},{"$f":"IF(ISNUMBER(SEARCH($D$3,E171)),MAX($D$4:$D170)+1,0)","v":166},"Warszawa Zachodnia , kasa nr 33","75 1140 1010 4167 0000 0051 1033","Warszawa Zachodnia ","K-33","33","Sekcja ","07:00 - 19:00",null,null,"wybierz kasę z listy",173,null,null,"Szczecin Główny","17","Szczecin Główny, kasa nr 17","35 1140 1010 4167 0000 0054 2017"]
[null,null,{"$f":"_xlfn.IFNA(VLOOKUP(ROWS($C$5:$C172),D172:E399,2,FALSE),\"\")","v":"Warszawa Zachodnia, kasa nr 31"},{"$f":"IF(ISNUMBER(SEARCH($D$3,E172)),MAX($D$4:$D171)+1,0)","v":167},"Warszawa Zachodnia, kasa nr 24","27 1140 1010 4167 0000 0051 1024","Warszawa Zachodnia","K-24","24","Sekcja ","07:00 - 19:00",null,null,"wybierz kasę z listy",176,null,null,"Świnoujście","7","Świnoujście, kasa nr 07","14 1140 1010 4167 0000 0054 2007"]
[null,null,{"$f":"_xlfn.IFNA(VLOOKUP(ROWS($C$5:$C173),D173:E400,2,FALSE),\"\")","v":"Warszawa Zachodnia, kasa nr 32"},{"$f":"IF(ISNUMBER(SEARCH($D$3,E173)),MAX($D$4:$D172)+1,0)","v":168},"Warszawa Zachodnia, kasa nr 31","32 1140 1010 4167 0000 0051 1031","Warszawa Zachodnia","K-31","31","Sekcja ","07:00 - 19:00",null,null,"wybierz kasę z listy",177,null,null,"Tarnów","2","Tarnów, kasa nr 02","87 1140 1010 4167 0000 0052 1002"]
[null,null,{"$f":"_xlfn.IFNA(VLOOKUP(ROWS($C$5:$C174),D174:E401,2,FALSE),\"\")","v":"Warszawa Zachodnia, kasa nr 68"},{"$f":"IF(ISNUMBER(SEARCH($D$3,E174)),MAX($D$4:$D173)+1,0)","v":169},"Warszawa Zachodnia, kasa nr 32","05 1140 1010 4167 0000 0051 1032","Warszawa zachodnia","K-32","32","Sekcja ","07:00 - 19:00",null,null,"wybierz kasę z listy",178,null,null,"Tarnów","22","Tarnów, kasa nr 22","32 1140 1010 4167 0000 0052 1022"]
[null,null,{"$f":"_xlfn.IFNA(VLOOKUP(ROWS($C$5:$C175),D175:E402,2,FALSE),\"\")","v":"Warszawa Zachodnia, kasa nr 69"},{"$f":"IF(ISNUMBER(SEARCH($D$3,E175)),MAX($D$4:$D174)+1,0)","v":170},"Warszawa Zachodnia, kasa nr 68","03 1140 1010 4167 0000 0051 1068","Warszawa Zachodnia","K-68","68","Sekcja ","07:00 - 19:00",null,null,"wybierz kasę z listy",179,null,null,"Tarnów","26","Tarnów, kasa nr 26","50 1140 1010 4167 0000 0052 3026"]
[null,null,{"$f":"_xlfn.IFNA(VLOOKUP(ROWS($C$5:$C176),D176:E403,2,FALSE),\"\")","v":"Warszawa, kasa nr 28"},{"$f":"IF(ISNUMBER(SEARCH($D$3,E176)),MAX($D$4:$D175)+1,0)","v":171},"Warszawa Zachodnia, kasa nr 69","73 1140 1010 4167 0000 0051 1069","Warszawa Zachodnia","K-69","69","Sekcja ","07:00 - 19:00",null,null,"wybierz kasę z listy",180,null,null,"Tczew","3","Tczew, kasa nr 03","59 1140 1010 4167 0000 0054 1003"]
[null,null,{"$f":"_xlfn.IFNA(VLOOKUP(ROWS($C$5:$C177),D177:E404,2,FALSE),\"\")","v":"Włocławek, kasa nr 09"},{"$f":"IF(ISNUMBER(SEARCH($D$3,E177)),MAX($D$4:$D176)+1,0)","v":172},"Warszawa, kasa nr 28","79 1140 1010 4167 0000 0051 2028","Warszawa","K-28","28","Sekcja ","07:00 - 19:00",null,null,"wybierz kasę z listy",181,null,null,"Tczew","11","Tczew, kasa nr 11","37 1140 1010 4167 0000 0054 1011"]
[null,null,{"$f":"_xlfn.IFNA(VLOOKUP(ROWS($C$5:$C178),D178:E405,2,FALSE),\"\")","v":"Włocławek, kasa nr 12"},{"$f":"IF(ISNUMBER(SEARCH($D$3,E178)),MAX($D$4:$D177)+1,0)","v":173},"Włocławek, kasa nr 09","23 1140 1010 4167 0000 0054 3009","Włocławek","K-09","9","Sekcja ","07:00 - 19:00",null,null,"wybierz kasę z listy",182,null,null,"Terespol - kasa konduktorska","8","Terespol - kasa konduktorska, kasa nr 08","78 1140 1010 4167 0000 0051 6508"]
[null,null,{"$f":"_xlfn.IFNA(VLOOKUP(ROWS($C$5:$C179),D179:E406,2,FALSE),\"\")","v":"Włoszczowa, kasa nr 22"},{"$f":"IF(ISNUMBER(SEARCH($D$3,E179)),MAX($D$4:$D178)+1,0)","v":174},"Włocławek, kasa nr 12","64 1140 1010 4167 0000 0004 3012","Włocławek","K-12","12","Sekcja ","07:00 - 19:00",null,null,"wybierz kasę z listy",183,null,null,"Terespol ","6","Terespol , kasa nr 06","18 1140 1010 4167 0000 0051 7006"]
[null,null,{"$f":"_xlfn.IFNA(VLOOKUP(ROWS($C$5:$C180),D180:E407,2,FALSE),\"\")","v":"Wrocław Główny, kasa nr 08"},{"$f":"IF(ISNUMBER(SEARCH($D$3,E180)),MAX($D$4:$D179)+1,0)","v":175},"Włoszczowa, kasa nr 22","17 1140 1010 4167 0000 0004 5022","Włoszczowa","K-22","22","Sekcja ","07:00 - 19:00",null,null,"wybierz kasę z listy",184,null,null,"Terespol","5","Terespol, kasa nr 05","79 1140 1010 4167 0000 0051 6005"]
[null,null,{"$f":"_xlfn.IFNA(VLOOKUP(ROWS($C$5:$C181),D181:E414,2,FALSE),\"\")","v":"Wrocław Główny, kasa nr 09"},{"$f":"IF(ISNUMBER(SEARCH($D$3,E181)),MAX($D$4:$D180)+1,0)","v":176},"Wrocław Główny, kasa nr 08","36 1140 1010 4167 0000 0053 2008","Wrocław Główny","K-08",8,"Sekcja Handlowa w Wrocławiu","07:00 - 19:00",null,null,"wybierz kasę z listy",191,null,null,"Warszawa Grochów - kasa konduktorska","2","Warszawa Grochów - kasa konduktorska, kasa nr 02","85 1140 1010 4167 0000 0051 2502"]
[null,null,{"$f":"_xlfn.IFNA(VLOOKUP(ROWS($C$5:$C182),D182:E415,2,FALSE),\"\")","v":"Wrocław Główny, kasa nr 11"},{"$f":"IF(ISNUMBER(SEARCH($D$3,E182)),MAX($D$4:$D181)+1,0)","v":177},"Wrocław Główny, kasa nr 09","09 1140 1010 4167 0000 0053 2009","Wrocław Główny","K-09",9,"Sekcja Handlowa w Wrocławiu","07:00 - 19:00",null,null,"wybierz kasę z listy",192,null,null,"Warszawa Senacka","36","Warszawa Senacka, kasa nr 36","91 1140 1010 4167 0000 0051 1036"]
[null,null,{"$f":"_xlfn.IFNA(VLOOKUP(ROWS($C$5:$C183),D183:E416,2,FALSE),\"\")","v":"Wrocław Główny, kasa nr 12"},{"$f":"IF(ISNUMBER(SEARCH($D$3,E183)),MAX($D$4:$D182)+1,0)","v":178},"Wrocław Główny, kasa nr 11","52 1140 1010 4167 0000 0053 2011","Wrocław Główny","K-11","11","Sekcja Handlowa w Wrocławiu","07:00 - 19:00",null,null,"wybierz kasę z listy",193,null,null,"Warszawa Zachodnia ","33","Warszawa Zachodnia , kasa nr 33","75 1140 1010 4167 0000 0051 1033"]
[null,null,{"$f":"_xlfn.IFNA(VLOOKUP(ROWS($C$5:$C184),D184:E417,2,FALSE),\"\")","v":"Wrocław Główny, kasa nr 13"},{"$f":"IF(ISNUMBER(SEARCH($D$3,E184)),MAX($D$4:$D183)+1,0)","v":179},"Wrocław Główny, kasa nr 12","25 1140 1010 4167 0000 0053 2012","Wrocław Główny","K-12","12","Sekcja Handlowa w Wrocławiu","07:00 - 19:00",null,null,"wybierz kasę z listy",194,null,null,"Warszawa Zachodnia COK West Station","35","Warszawa Zachodnia COK West Station, kasa nr 35","74 1140 1010 4167 0000 0051 8035"]
[null,null,{"$f":"_xlfn.IFNA(VLOOKUP(ROWS($C$5:$C185),D185:E418,2,FALSE),\"\")","v":"Wrocław Główny, kasa nr 14"},{"$f":"IF(ISNUMBER(SEARCH($D$3,E185)),MAX($D$4:$D184)+1,0)","v":180},"Wrocław Główny, kasa nr 13","95 1140 1010 4167 0000 0053 2013","Wrocław Główny",{"$f":"IF(VALUE(I185)<10,\"K-\"&\"0\"&I185,\"K-\"&I185)","v":"K-13"},"13","Sekcja Handlowa w Wrocławiu","07:00 - 19:00",null,null,"wybierz kasę z listy",195,null,null,"Warszawa Zachodnia COK West Station","38","Warszawa Zachodnia COK West Station, kasa nr 38","90 1140 1010 4167 0000 0051 8038"]
[null,null,{"$f":"_xlfn.IFNA(VLOOKUP(ROWS($C$5:$C186),D186:E419,2,FALSE),\"\")","v":"Wrocław Główny, kasa nr 15"},{"$f":"IF(ISNUMBER(SEARCH($D$3,E186)),MAX($D$4:$D185)+1,0)","v":181},"Wrocław Główny, kasa nr 14","68 1140 1010 4167 0000 0053 2014","Wrocław Główny","K-14","14","Sekcja Handlowa w Wrocławiu","07:00 - 19:00",null,null,"wybierz kasę z listy",196,null,null,"Warszawa Zachodnia","24","Warszawa Zachodnia, kasa nr 24","27 1140 1010 4167 0000 0051 1024"]
[null,null,{"$f":"_xlfn.IFNA(VLOOKUP(ROWS($C$5:$C187),D187:E420,2,FALSE),\"\")","v":"Wrocław Główny, kasa nr 16"},{"$f":"IF(ISNUMBER(SEARCH($D$3,E187)),MAX($D$4:$D186)+1,0)","v":182},"Wrocław Główny, kasa nr 15","41 1140 1010 4167 0000 0053 2015","Wrocław Główny","K-15","15","Sekcja Handlowa w Wrocławiu","07:00 - 19:00",null,null,"wybierz kasę z listy",197,null,null,"Warszawa Zachodnia","31","Warszawa Zachodnia, kasa nr 31","32 1140 1010 4167 0000 0051 1031"]
[null,null,{"$f":"_xlfn.IFNA(VLOOKUP(ROWS($C$5:$C188),D188:E421,2,FALSE),\"\")","v":"Wrocław Główny, kasa nr 19"},{"$f":"IF(ISNUMBER(SEARCH($D$3,E188)),MAX($D$4:$D187)+1,0)","v":183},"Wrocław Główny, kasa nr 16","14 1140 1010 4167 0000 0053 2016","Wrocław Główny","K-16","16","Sekcja Handlowa w Wrocławiu","07:00 - 19:00",null,null,"wybierz kasę z listy",198,null,null,"Warszawa zachodnia","32","Warszawa zachodnia, kasa nr 32","05 1140 1010 4167 0000 0051 1032"]
[null,null,{"$f":"_xlfn.IFNA(VLOOKUP(ROWS($C$5:$C189),D189:E422,2,FALSE),\"\")","v":"Wrocław Główny, kasa nr 20"},{"$f":"IF(ISNUMBER(SEARCH($D$3,E189)),MAX($D$4:$D188)+1,0)","v":184},"Wrocław Główny, kasa nr 19","30 1140 1010 4167 0000 0053 2019","Wrocław Główny","K-19","19","Sekcja Handlowa w Wrocławiu","07:00 - 19:00",null,null,"wybierz kasę z listy",199,null,null,"Warszawa Zachodnia","68","Warszawa Zachodnia, kasa nr 68","03 1140 1010 4167 0000 0051 1068"]
[null,null,{"$f":"_xlfn.IFNA(VLOOKUP(ROWS($C$5:$C190),D190:E423,2,FALSE),\"\")","v":"Wrocław Mikołajów, kasa nr 18"},{"$f":"IF(ISNUMBER(SEARCH($D$3,E190)),MAX($D$4:$D189)+1,0)","v":185},"Wrocław Główny, kasa nr 20","03 1140 1010 4167 0000 0053 2020","Wrocław Główny","K-20","20","Sekcja Handlowa w Wrocławiu","07:00 - 19:00",null,null,"wybierz kasę z listy",200,null,null,"Warszawa Zachodnia","69","Warszawa Zachodnia, kasa nr 69","73 1140 1010 4167 0000 0051 1069"]
[null,null,{"$f":"_xlfn.IFNA(VLOOKUP(ROWS($C$5:$C191),D191:E424,2,FALSE),\"\")","v":"W-wa Szczęśliwicka, kasa nr 35"},{"$f":"IF(ISNUMBER(SEARCH($D$3,E191)),MAX($D$4:$D190)+1,0)","v":186},"Wrocław Mikołajów, kasa nr 18","57 1140 1010 4167 0000 0053 2018","Wrocław Mikołajów","K-18","18","Sekcja Handlowa w Wrocławiu","07:00 - 19:00",null,null,"wybierz kasę z listy",201,null,null,"Warszawa","28","Warszawa, kasa nr 28","79 1140 1010 4167 0000 0051 2028"]
[null,null,{"$f":"_xlfn.IFNA(VLOOKUP(ROWS($C$5:$C192),D192:E425,2,FALSE),\"\")","v":"Zabrze, kasa nr 11"},{"$f":"IF(ISNUMBER(SEARCH($D$3,E192)),MAX($D$4:$D191)+1,0)","v":187},"W-wa Szczęśliwicka, kasa nr 35","21 1140 1010 4167 0000 0051 1035","W-wa Szczęśliwicka","K-35","35","Sekcja ","07:00 - 19:00",null,null,"wybierz kasę z listy",202,null,null,"Włocławek","9","Włocławek, kasa nr 09","23 1140 1010 4167 0000 0054 3009"]
[null,null,{"$f":"_xlfn.IFNA(VLOOKUP(ROWS($C$5:$C193),D193:E426,2,FALSE),\"\")","v":"Zabrze, kasa nr 45"},{"$f":"IF(ISNUMBER(SEARCH($D$3,E193)),MAX($D$4:$D192)+1,0)","v":188},"Zabrze, kasa nr 11","04 1140 1010 4167 0000 0052 2011","Zabrze","K-11","11","Sekcja Handlowa w Katowicach","12:40 - 20:40","olga.glab@intercity.pl;anna.jablonska@intercity.pl;zdzislawa.rosochacka@intercity.pl;",null,251,203,null,null,"Włocławek","12","Włocławek, kasa nr 12","64 1140 1010 4167 0000 0004 3012"]
[null,null,{"$f":"_xlfn.IFNA(VLOOKUP(ROWS($C$5:$C194),D194:E427,2,FALSE),\"\")","v":"Zakopane, kasa nr 24"},{"$f":"IF(ISNUMBER(SEARCH($D$3,E194)),MAX($D$4:$D193)+1,0)","v":189},"Zabrze, kasa nr 45","56 1140 1010 4167 0000 0052 2045","Zabrze","K-45","45","Sekcja Handlowa w Katowicach","05:00 - 17:00","olga.glab@intercity.pl;anna.jablonska@intercity.pl;zdzislawa.rosochacka@intercity.pl;",null,252,204,null,null,"Włoszczowa","22","Włoszczowa, kasa nr 22","17 1140 1010 4167 0000 0004 5022"]
[null,null,{"$f":"_xlfn.IFNA(VLOOKUP(ROWS($C$5:$C195),D195:E428,2,FALSE),\"\")","v":"Zakopane, kasa nr 25"},{"$f":"IF(ISNUMBER(SEARCH($D$3,E195)),MAX($D$4:$D194)+1,0)","v":190},"Zakopane, kasa nr 24","75 1140 1010 4167 0000 0052 1024","Zakopane","K-24","24","Sekcja Handlowa w Krakowie","07:00 - 19:00",null,null,"wybierz kasę z listy",205,null,null,"Wrocław Główny - Centrum Obsługi Klienta","10","Wrocław Główny - Centrum Obsługi Klienta, kasa nr 10","79 1140 1010 4167 0000 0053 2010"]
[null,null,{"$f":"_xlfn.IFNA(VLOOKUP(ROWS($C$5:$C196),D196:E429,2,FALSE),\"\")","v":"Zawiercie, kasa nr 07"},{"$f":"IF(ISNUMBER(SEARCH($D$3,E196)),MAX($D$4:$D195)+1,0)","v":191},"Zakopane, kasa nr 25","48 1140 1010 4167 0000 0052 1025","Zakopane","K-25","25","Sekcja Handlowa w Krakowie","07:00 - 19:00",null,null,"wybierz kasę z listy",206,null,null,"Wrocław Główny - Centrum Obsługi Klienta","31","Wrocław Główny - Centrum Obsługi Klienta, kasa nr 31","94 1140 1010 4167 0000 0053 2031"]
[null,null,{"$f":"_xlfn.IFNA(VLOOKUP(ROWS($C$5:$C197),D197:E430,2,FALSE),\"\")","v":"Zawiercie, kasa nr 48"},{"$f":"IF(ISNUMBER(SEARCH($D$3,E197)),MAX($D$4:$D196)+1,0)","v":192},"Zawiercie, kasa nr 07","15 1140 1010 4167 0000 0052 2007","Zawiercie","K-07","7","Sekcja Handlowa w Katowicach","06:30 - 18:30","olga.glab@intercity.pl;anna.jablonska@intercity.pl;zdzislawa.rosochacka@intercity.pl;",null,255,207,null,null,"Wrocław Główny - Centrum Obsługi Klienta","32","Wrocław Główny - Centrum Obsługi Klienta, kasa nr 32","67 1140 1010 4167 0000 0053 2032"]
[null,null,{"$f":"_xlfn.IFNA(VLOOKUP(ROWS($C$5:$C198),D198:E431,2,FALSE),\"\")","v":"Zbąszynek, kasa nr 15"},{"$f":"IF(ISNUMBER(SEARCH($D$3,E198)),MAX($D$4:$D197)+1,0)","v":193},"Zawiercie, kasa nr 48","72 1140 1010 4167 0000 0052 2048","Zawiercie","K-48","48","Sekcja Handlowa w Katowicach","07:00 - 19:00","olga.glab@intercity.pl;anna.jablonska@intercity.pl;zdzislawa.rosochacka@intercity.pl;",null,256,208,null,null,"Wrocław Główny - Centrum Obsługi Klienta","33","Wrocław Główny - Centrum Obsługi Klienta, kasa nr 33","40 1140 1010 4167 0000 0053 2033"]
[null,null,{"$f":"_xlfn.IFNA(VLOOKUP(ROWS($C$5:$C199),D199:E432,2,FALSE),\"\")","v":"Zebrzydowice, kasa nr 38"},{"$f":"IF(ISNUMBER(SEARCH($D$3,E199)),MAX($D$4:$D198)+1,0)","v":194},"Zbąszynek, kasa nr 15","75 1140 1010 4167 0000 0053 1015","Zbąszynek","K-15","15","Sekcja ","07:00 - 19:00",null,null,"wybierz kasę z listy",209,null,null,"Wrocław Główny - Centrum Obsługi Klienta","34","Wrocław Główny - Centrum Obsługi Klienta, kasa nr 34","13 1140 1010 4167 0000 0053 2034"]
[null,null,{"$f":"_xlfn.IFNA(VLOOKUP(ROWS($C$5:$C200),D200:E433,2,FALSE),\"\")","v":"Zielona Góra, kasa nr 13"},{"$f":"IF(ISNUMBER(SEARCH($D$3,E200)),MAX($D$4:$D199)+1,0)","v":195},"Zebrzydowice, kasa nr 38","51 1140 1010 4167 0000 0052 2038","Zebrzydowice","K-38","38","Sekcja Handlowa w Katowicach","07:00 - 19:00","olga.glab@intercity.pl;anna.jablonska@intercity.pl;zdzislawa.rosochacka@intercity.pl;",null,"wybierz kasę z listy",210,null,null,"Wrocław Główny - Centrum Obsługi Klienta","35","Wrocław Główny - Centrum Obsługi Klienta, kasa nr 35","83 1140 1010 4167 0000 0053 2035"]
[null,null,"",{"$f":"IF(ISNUMBER(SEARCH($D$3,E201)),MAX($D$4:$D200)+1,0)","v":196},"Zielona Góra, kasa nr 13","32 1140 1010 4167 0000 0053 1013","Zielona Góra","K-13","13","Sekcja ","07:00 - 19:00",null,null,"wybierz kasę z listy",211,null,null,"Wrocław Główny - kasa konduktorska","1","Wrocław Główny - kasa konduktorska, kasa nr 01","14 1140 1010 4167 0000 0053 2501"]
[null,null,{"$f":"_xlfn.IFNA(VLOOKUP(ROWS($C$5:$C202),D202:E435,2,FALSE),\"\")","v":""},{"$f":"IF(ISNUMBER(SEARCH($D$3,E202)),MAX($D$4:$D201)+1,0)","v":0},null,null,null,null,null,null,null,null,null,null,212,null,null,"Wrocław Główny - kasa konduktorska","2","Wrocław Główny - kasa konduktorska, kasa nr 02","84 1140 1010 4167 0000 0053 2502"]
[null,null,{"$f":"_xlfn.IFNA(VLOOKUP(ROWS($C$5:$C203),D203:E436,2,FALSE),\"\")","v":""},{"$f":"IF(ISNUMBER(SEARCH($D$3,E203)),MAX($D$4:$D202)+1,0)","v":0},null,null,null,null,null,null,null,null,null,null,213,null,null,"Wrocław Główny","08","Wrocław Główny, kasa nr 08","36 1140 1010 4167 0000 0053 2008"]
[null,null,{"$f":"_xlfn.IFNA(VLOOKUP(ROWS($C$5:$C204),D204:E437,2,FALSE),\"\")","v":""},{"$f":"IF(ISNUMBER(SEARCH($D$3,E204)),MAX($D$4:$D203)+1,0)","v":0},null,null,null,null,null,null,null,null,null,null,214,null,null,"Wrocław Główny","09","Wrocław Główny, kasa nr 09","09 1140 1010 4167 0000 0053 2009"]
[null,null,{"$f":"_xlfn.IFNA(VLOOKUP(ROWS($C$5:$C205),D205:E438,2,FALSE),\"\")","v":""},{"$f":"IF(ISNUMBER(SEARCH($D$3,E205)),MAX($D$4:$D204)+1,0)","v":0},null,null,null,null,null,null,null,null,null,null,215,null,null,"Wrocław Główny","11","Wrocław Główny, kasa nr 11","52 1140 1010 4167 0000 0053 2011"]
[null,null,{"$f":"_xlfn.IFNA(VLOOKUP(ROWS($C$5:$C206),D206:E439,2,FALSE),\"\")","v":""},{"$f":"IF(ISNUMBER(SEARCH($D$3,E206)),MAX($D$4:$D205)+1,0)","v":0},null,null,null,null,null,null,null,null,null,null,216,null,null,"Wrocław Główny","12","Wrocław Główny, kasa nr 12","25 1140 1010 4167 0000 0053 2012"]
[null,null,{"$f":"_xlfn.IFNA(VLOOKUP(ROWS($C$5:$C207),D207:E440,2,FALSE),\"\")","v":""},{"$f":"IF(ISNUMBER(SEARCH($D$3,E207)),MAX($D$4:$D206)+1,0)","v":0},null,null,null,null,null,null,null,null,null,null,217,null,null,"Wrocław Główny","13","Wrocław Główny, kasa nr 13","95 1140 1010 4167 0000 0053 2013"]
[null,null,{"$f":"_xlfn.IFNA(VLOOKUP(ROWS($C$5:$C208),D208:E441,2,FALSE),\"\")","v":""},{"$f":"IF(ISNUMBER(SEARCH($D$3,E208)),MAX($D$4:$D207)+1,0)","v":0},null,null,null,null,null,null,null,null,null,null,218,null,null,"Wrocław Główny","14","Wrocław Główny, kasa nr 14","68 1140 1010 4167 0000 0053 2014"]
[null,null,{"$f":"_xlfn.IFNA(VLOOKUP(ROWS($C$5:$C209),D209:E442,2,FALSE),\"\")","v":""},{"$f":"IF(ISNUMBER(SEARCH($D$3,E209)),MAX($D$4:$D208)+1,0)","v":0},null,null,null,null,null,null,null,null,null,null,219,null,null,"Wrocław Główny","15","Wrocław Główny, kasa nr 15","41 1140 1010 4167 0000 0053 2015"]
[null,null,{"$f":"_xlfn.IFNA(VLOOKUP(ROWS($C$5:$C210),D210:E443,2,FALSE),\"\")","v":""},{"$f":"IF(ISNUMBER(SEARCH($D$3,E210)),MAX($D$4:$D209)+1,0)","v":0},null,null,null,null,null,null,null,null,null,null,220,null,null,"Wrocław Główny","16","Wrocław Główny, kasa nr 16","14 1140 1010 4167 0000 0053 2016"]
[null,null,{"$f":"_xlfn.IFNA(VLOOKUP(ROWS($C$5:$C211),D211:E444,2,FALSE),\"\")","v":""},{"$f":"IF(ISNUMBER(SEARCH($D$3,E211)),MAX($D$4:$D210)+1,0)","v":0},null,null,null,null,null,null,null,null,null,null,221,null,null,"Wrocław Główny","19","Wrocław Główny, kasa nr 19","30 1140 1010 4167 0000 0053 2019"]
[null,null,{"$f":"_xlfn.IFNA(VLOOKUP(ROWS($C$5:$C212),D212:E445,2,FALSE),\"\")","v":""},{"$f":"IF(ISNUMBER(SEARCH($D$3,E212)),MAX($D$4:$D211)+1,0)","v":0},null,null,null,null,null,null,null,null,null,null,222,null,null,"Wrocław Główny","20","Wrocław Główny, kasa nr 20","03 1140 1010 4167 0000 0053 2020"]
[null,null,{"$f":"_xlfn.IFNA(VLOOKUP(ROWS($C$5:$C213),D213:E446,2,FALSE),\"\")","v":""},{"$f":"IF(ISNUMBER(SEARCH($D$3,E213)),MAX($D$4:$D212)+1,0)","v":0},null,null,null,null,null,null,null,null,null,null,223,null,null,"Wrocław Mikołajów","18","Wrocław Mikołajów, kasa nr 18","57 1140 1010 4167 0000 0053 2018"]
[null,null,{"$f":"_xlfn.IFNA(VLOOKUP(ROWS($C$5:$C214),D214:E447,2,FALSE),\"\")","v":""},{"$f":"IF(ISNUMBER(SEARCH($D$3,E214)),MAX($D$4:$D213)+1,0)","v":0},null,null,null,null,null,null,null,null,null,null,224,null,null,"W-wa Szczęśliwicka","35","W-wa Szczęśliwicka, kasa nr 35","21 1140 1010 4167 0000 0051 1035"]
[null,null,{"$f":"_xlfn.IFNA(VLOOKUP(ROWS($C$5:$C215),D215:E448,2,FALSE),\"\")","v":""},{"$f":"IF(ISNUMBER(SEARCH($D$3,E215)),MAX($D$4:$D214)+1,0)","v":0},null,null,null,null,null,null,null,null,null,null,225,null,null,"Zabrze","11","Zabrze, kasa nr 11","04 1140 1010 4167 0000 0052 2011"]
[null,null,{"$f":"_xlfn.IFNA(VLOOKUP(ROWS($C$5:$C216),D216:E449,2,FALSE),\"\")","v":""},{"$f":"IF(ISNUMBER(SEARCH($D$3,E216)),MAX($D$4:$D215)+1,0)","v":0},null,null,null,null,null,null,null,null,null,null,226,null,null,"Zabrze","45","Zabrze, kasa nr 45","56 1140 1010 4167 0000 0052 2045"]
[null,null,{"$f":"_xlfn.IFNA(VLOOKUP(ROWS($C$5:$C217),D217:E450,2,FALSE),\"\")","v":""},{"$f":"IF(ISNUMBER(SEARCH($D$3,E217)),MAX($D$4:$D216)+1,0)","v":0},null,null,null,null,null,null,null,null,null,null,227,null,null,"Zakopane","24","Zakopane, kasa nr 24","75 1140 1010 4167 0000 0052 1024"]
[null,null,{"$f":"_xlfn.IFNA(VLOOKUP(ROWS($C$5:$C218),D218:E451,2,FALSE),\"\")","v":""},{"$f":"IF(ISNUMBER(SEARCH($D$3,E218)),MAX($D$4:$D217)+1,0)","v":0},null,null,null,null,null,null,null,null,null,null,228,null,null,"Zakopane","25","Zakopane, kasa nr 25","48 1140 1010 4167 0000 0052 1025"]
[null,null,{"$f":"_xlfn.IFNA(VLOOKUP(ROWS($C$5:$C219),D219:E452,2,FALSE),\"\")","v":""},{"$f":"IF(ISNUMBER(SEARCH($D$3,E219)),MAX($D$4:$D218)+1,0)","v":0},null,null,null,null,null,null,null,null,null,null,229,null,null,"Zawiercie","7","Zawiercie, kasa nr 07","15 1140 1010 4167 0000 0052 2007"]
[null,null,{"$f":"_xlfn.IFNA(VLOOKUP(ROWS($C$5:$C220),D220:E453,2,FALSE),\"\")","v":""},{"$f":"IF(ISNUMBER(SEARCH($D$3,E220)),MAX($D$4:$D219)+1,0)","v":0},null,null,null,null,null,null,null,null,null,null,230,null,null,"Zawiercie","48","Zawiercie, kasa nr 48","72 1140 1010 4167 0000 0052 2048"]
[null,null,{"$f":"_xlfn.IFNA(VLOOKUP(ROWS($C$5:$C221),D221:E454,2,FALSE),\"\")","v":""},{"$f":"IF(ISNUMBER(SEARCH($D$3,E221)),MAX($D$4:$D220)+1,0)","v":0},null,null,null,null,null,null,null,null,null,null,231,null,null,"Zbąszynek","15","Zbąszynek, kasa nr 15","75 1140 1010 4167 0000 0053 1015"]
[null,null,{"$f":"_xlfn.IFNA(VLOOKUP(ROWS($C$5:$C222),D222:E455,2,FALSE),\"\")","v":""},{"$f":"IF(ISNUMBER(SEARCH($D$3,E222)),MAX($D$4:$D221)+1,0)","v":0},null,null,null,null,null,null,null,null,null,null,232,null,null,"Zebrzydowice","38","Zebrzydowice, kasa nr 38","51 1140 1010 4167 0000 0052 2038"]
[null,null,{"$f":"_xlfn.IFNA(VLOOKUP(ROWS($C$5:$C223),D223:E456,2,FALSE),\"\")","v":""},{"$f":"IF(ISNUMBER(SEARCH($D$3,E223)),MAX($D$4:$D222)+1,0)","v":0},null,null,null,null,null,null,null,null,null,null,233,null,null,"Zielona Góra","13","Zielona Góra, kasa nr 13","32 1140 1010 4167 0000 0053 1013"]
[null,null,null,{"$f":"IF(ISNUMBER(SEARCH($D$3,E224)),MAX($D$4:$D223)+1,0)","v":0},null,null,null,null,null,null,null,null,null,null,234]